program: Orca
programVersion: 5.0.2
elementType: N H C H C O C C O N H C H H H O H H S H C O C H H C H H C H N H H C O O H H
charge: 1
multiplicity: 1
keywords: wB97X-D3BJ Opt Freq def2-TZVPP def2/J RIJCOSX VeryTightSCF
keywords: PAL8 defgrid3 TightOpt
frequency: 0.00 0.00 0.00 0.00 0.00 0.00 18.33 20.43 31.10 37.78 41.11 46.65 61.27 72.59 97.72 103.20 127.14 140.95 170.26 173.39 219.13 227.65 249.40 266.43 287.61 310.58 329.40 343.05 353.97 421.84 423.79 466.01 484.83 498.48 508.41 529.68 541.49 590.34 604.43 625.14 644.40 671.99 705.15 721.28 735.54 753.36 763.33 793.80 804.98 843.96 859.86 862.17 927.86 943.68 951.11 972.41 1006.50 1056.58 1064.29 1077.33 1107.74 1128.33 1153.53 1179.45 1181.50 1198.29 1215.20 1221.10 1254.94 1268.97 1286.77 1296.01 1318.80 1330.36 1347.13 1367.18 1374.81 1384.32 1387.56 1397.45 1424.05 1430.78 1459.46 1460.77 1464.92 1477.22 1493.37 1508.44 1551.79 1582.20 1645.97 1693.77 1713.04 1799.39 1859.30 1880.60 2507.50 2757.39 3078.92 3087.41 3112.25 3124.04 3126.13 3137.90 3162.36 3169.41 3178.03 3184.32 3502.43 3541.76 3558.90 3681.62 3784.97 3800.50
frequency: 18.33 20.43 31.10 37.78 41.11 46.65 61.27 72.59 97.72 103.20 127.14 140.95 170.26 173.39 219.13 227.65 249.40 266.43 287.61 310.58 329.40 343.05 353.97 421.84 423.79 466.01 484.83 498.48 508.41 529.68 541.49 590.34 604.43 625.14 644.40 671.99 705.15 721.28 735.54 753.36 763.33 793.80 804.98 843.96 859.86 862.17 927.86 943.68 951.11 972.41 1006.50 1056.58 1064.29 1077.33 1107.74 1128.33 1153.53 1179.45 1181.50 1198.29 1215.20 1221.10 1254.94 1268.97 1286.77 1296.01 1318.80 1330.36 1347.13 1367.18 1374.81 1384.32 1387.56 1397.45 1424.05 1430.78 1459.46 1460.77 1464.92 1477.22 1493.37 1508.44 1551.79 1582.20 1645.97 1693.77 1713.04 1799.39 1859.30 1880.60 2507.50 2757.39 3078.92 3087.41 3112.25 3124.04 3126.13 3137.90 3162.36 3169.41 3178.03 3184.32 3502.43 3541.76 3558.90 3681.62 3784.97 3800.50
formula: C10H18N3O6S
InChI: InChI=1S/C10H18N3O6S/c11-5(10(18)19)1-2-7(14)13-6(4-20)9(17)12-3-8(15)16/h5-6,12-13,15,18,20H,1-4H2,11H3
38 atoms
N  -2.939211 -1.634529 -1.237143
H  -2.690448 -2.595555 -1.08007
C  -4.257657 -1.340138 -1.755722
H  -4.232842 -0.395762 -2.297179
C  -5.351628 -1.221275 -0.7043
O  -6.469814 -0.887053 -0.965124
C  -2.209175 -0.663512 -0.649522
C  -0.971077 -1.130189 0.132578
O  -2.502079 0.515877 -0.670829
N  -0.048367 -0.013848 0.129067
H  -0.520505 -1.99752 -0.347326
C  -1.43852 -1.493719 1.551956
H  -0.509095 0.891217 0.094738
H  -2.000639 -0.663456 1.977536
H  -2.117141 -2.345766 1.504257
O  -4.937331 -1.551017 0.537898
H  -5.70197 -1.445651 1.120208
H  -4.5575 -2.118293 -2.457411
S  -0.104068 -1.956849 2.677552
H  0.195104 -0.721687 3.094113
C  1.279575 0.009203 0.063658
O  1.874339 1.105592 0.06338
C  2.091415 -1.26388 -0.091573
H  1.462057 -2.147292 -0.147655
H  2.577784 -1.162778 -1.066629
C  3.147993 -1.533833 0.999636
H  3.861676 -2.257409 0.596397
H  2.668355 -2.008746 1.853708
C  3.912134 -0.322134 1.543144
H  3.262566 0.268316 2.191653
N  4.339232 0.594677 0.450625
H  4.872494 0.103154 -0.263917
H  3.398539 0.977805 0.075424
C  5.151386 -0.725731 2.327098
O  6.254358 -0.356542 2.027341
O  4.844972 -1.512587 3.353441
H  5.657306 -1.741079 3.828422
H  4.942772 1.332462 0.810909
totalener: -1406.24079861 hartree
nucrepener: 1763.36156818 hartree
electener: -3169.60236679 hartree
oneelecener: -5410.82466344 hartree
twoeener: 2241.22229665 hartree
kineticenergy: 1400.64325751 hartree
exchangeener: -105.320391738029 hartree
correlationener: -7.050703806863 hartree
xcener: -112.371095544891 hartree
temp: 298.15 k
press: 1.00 atm
thermalcorrenthalpy: 0.00094421 hartree
totalenthalpy: -1405.99001401 hartree
totalentropycorr: -0.06689393 hartree
gibbsenthalpy: -1406.05690793 hartree
gibbsminuselec: 0.26110192 hartree
chargesum: 1.0000000
charge: -0.205995 0.177254 -0.072244 0.143784 0.289097 -0.275546 0.283336 -0.015194 -0.360943 -0.122779 0.100849 -0.144899 0.209254 0.141312 0.122863 -0.284532 0.233413 0.133483 -0.149011 0.109071 0.255368 -0.407930 -0.193138 0.111103 0.146931 -0.246690 0.136868 0.138793 -0.014144 0.154889 -0.062515 0.214873 0.226732 0.274907 -0.287304 -0.246442 0.255518 0.229605
charge: 0.331893 -0.021951 -0.031878 0.046830 -0.433945 0.140826 -0.385783 -0.136592 0.106938 0.370794 0.024418 -0.240479 0.006621 0.019108 0.014698 0.344364 -0.084072 0.039391 0.510990 -0.150224 -0.343165 0.131204 -0.006118 0.027667 0.038053 -0.003559 0.037143 0.028584 -0.063827 0.046583 0.597627 0.041188 -0.069799 -0.443625 0.134171 0.396639 -0.064614 0.043902
qa: -0.2060 0.1773 -0.0722 0.1438 0.2891 -0.2755 0.2833 -0.0152 -0.3609 -0.1228 0.1008 -0.1449 0.2093 0.1413 0.1229 -0.2845 0.2334 0.1335 -0.1490 0.1091 0.2554 -0.4079 -0.1931 0.1111 0.1469 -0.2467 0.1369 0.1388 -0.0141 0.1549 -0.0625 0.2149 0.2267 0.2749 -0.2873 -0.2464 0.2555 0.2296
va: 3.2168 1.0123 3.8094 1.0192 4.3056 2.2355 4.2513 3.9342 2.1608 3.2322 1.0154 3.8758 1.0296 1.0149 1.0227 2.1587 1.0215 1.0013 2.1877 1.0239 4.2055 2.1157 3.8334 1.0287 1.0052 3.8411 1.0043 1.0334 3.8288 1.0093 3.5986 0.9935 1.0979 4.4134 2.2108 2.2494 1.0036 0.9855
dispcorr: -0.077960162 hartree
energy: -1406.323651631419
dipole: 8.39604 -4.21620 4.17984 -2.87477 1.84112 -1.03365 -1.94205 2.20929 0.26724
magnitude: 4.31403 au
magnitude: 10.96541 debye
zeropoint: 0.30965659 hartree
thermalvibcorrection: 0.01892592 hartree
thermalrotcorrection: 0.00141627 hartree
thermaltrasncorrection: 0.00141627 hartree
thermaltotal: -1405.99223658 hartree
thermalcorr: 0.02175846 hartree
nonthermalcorr: 0.30965659 hartree
totalcorr: 0.33141505 hartree
totalenthalpy: -1405.99129237 hartree
