program: Gaussian 09
title: 000048517
version: EM64L-G09RevD.01
frameworkgroup: C1[X(C12H16N2O3S)]
method: RPBEPBE
basis: SDD
operation: Freq
keyword: #p
keyword: freq=noraman
keyword: PBEPBE/SDD
title: #p freq=noraman PBEPBE/SDD
converged: YES YES NO NO
title: Mulliken charges:
elementType: S O O O N N C C C C C C C C C C C C H H H H H H H H H H H H H H H H
charge: 0.203156 -0.178920 -0.207934 -0.220324 -0.378979 -0.376500 0.093285 -0.471956 -0.521020 0.197669 0.158989 -0.661094 -0.052442 0.147946 -0.711793 -0.580031 -0.000431 -0.544834 0.279710 0.229497 0.247841 0.244057 0.224320 0.249541 0.366518 0.365207 0.247160 0.267532 0.254101 0.214411 0.232284 0.236687 0.224569 0.221776
chargesum: 0.00000
title: Mulliken charges with hydrogens summed into heavy atoms:
elementType: S O O O N N C C C C C C C C C C C C
charge: 0.203156 -0.178920 -0.207934 -0.220324 -0.012461 -0.011292 0.093285 -0.192246 -0.043682 0.197669 0.158989 0.056824 0.194718 0.147946 -0.190160 -0.133336 0.236255 -0.098488
polarizability: 2.03185417e+02 2.76859592e+00 1.62345007e+02 -1.76666705e+01 1.47214286e+00 1.55090477e+02
1716.lowfreq: -6.1204 0.0017 0.0018 0.0023 6.7432 11.3499 18.0184 21.5263 44.7814
frequency: 15.6579 21.4605 44.7441 51.2526 65.3485 70.9929 85.4258 120.6324 146.4716 148.0992 158.5259 170.7031 182.0404 222.6214 235.3364 261.9610 282.2486 317.7105 350.2290 359.2876 360.8753 393.9723 402.0176 439.6230 485.7692 507.1148 556.7950 591.8529 607.4535 623.0119 630.5195 647.0085 683.1554 707.6245 727.2827 746.3837 769.9517 778.9451 835.4461 877.9362 904.3124 938.2380 952.9328 953.6075 953.9386 987.0900 988.9429 995.8170 1001.0056 1016.1338 1058.4739 1075.8702 1086.1310 1115.4431 1144.1464 1179.2799 1196.6385 1220.2739 1249.7702 1267.2661 1286.3348 1290.2965 1291.8524 1310.1491 1324.4221 1358.2278 1373.9401 1376.6282 1403.7317 1418.5882 1423.3572 1446.3558 1452.5370 1465.3771 1473.4277 1620.8412 1652.3453 1658.7471 1661.6523 1674.4838 2993.4000 3008.2875 3010.9640 3018.9981 3080.1951 3081.6172 3088.3245 3090.2221 3093.9181 3106.8556 3111.3903 3118.2072 3200.9931 3204.6661 3520.2607 3523.3113
redmass: 4.4332 5.1678 4.5388 2.6118 2.9550 4.1420 3.6294 3.9758 5.1631 3.7700 9.0099 5.6239 4.2815 2.9515 1.3661 2.8442 3.0298 3.7985 5.4693 5.6532 6.1605 2.2223 2.2161 3.0130 8.6676 4.3629 2.3255 3.9821 3.6851 3.8455 2.6341 2.9273 2.6106 3.1796 2.4495 2.1347 3.2867 1.8296 2.1057 1.3420 2.8673 2.0177 2.0149 1.3259 1.3652 2.7169 2.2409 2.0686 1.1308 1.1948 1.7623 1.3773 3.1693 2.8280 2.6281 4.5914 1.5449 1.2282 1.2393 1.3568 1.7499 1.3903 1.5129 1.3218 1.3972 9.3786 1.8595 1.5238 1.1972 1.1513 1.1561 1.1075 1.1225 1.0596 1.0458 7.3424 4.5602 5.2122 7.7583 5.5478 1.0372 1.0809 1.0604 1.0588 1.0992 1.0976 1.0971 1.0636 1.0674 1.0987 1.0949 1.0964 1.1150 1.1147 1.0763 1.0777
irintensity: 0.5303 0.0892 0.1141 0.9468 0.4562 0.1619 0.1480 0.7989 2.2359 1.5072 5.7494 3.1331 0.4101 0.5795 0.1100 1.2951 1.8247 2.4153 5.2434 10.5242 22.1293 1.1739 0.3779 4.5517 12.6612 19.4087 7.2825 8.8654 4.1137 8.8258 28.3318 2.4280 35.0815 13.7120 19.2273 20.1421 2.4537 193.4762 6.3538 9.4149 3.8485 2.8474 12.9294 75.0852 77.9683 3.5094 3.6843 11.9374 12.9854 26.3811 24.0291 2.2607 5.8490 66.5877 11.6440 19.2500 1.8999 30.8064 6.0553 12.7371 104.7296 59.5496 72.2258 30.1976 38.2011 225.3813 3.4246 6.4060 27.9363 11.6912 4.8893 22.9596 11.1861 9.8532 7.2304 273.1098 7.6548 8.9243 108.5101 588.5817 16.4242 3.5789 25.6041 12.2919 12.7564 7.9455 2.5139 7.4858 13.2307 15.3968 13.7879 12.0331 24.1498 24.0650 82.4507 48.8468
temp: 298.150 k
press: 1.00000 atm
elementType: 16 8 8 8 7 7 6 6 6 6 6 6 6 6 6 6 6 6 1 1 1 1 1 1 1 1 1 1 1 1 1 1 1 1
symmnumber: 1
zpe: 694932.9 jmol-1
zpe.correction: 0.264686 hartree
zpe.thermalcorrener: 0.284354 hartree
zpe.thermalcorrenthalpy: 0.285298 hartree
zpe.thermalcorrgfe: 0.214029 hartree
zpe.sumelectzpe: -1198.745929 hartree
zpe.sumelectthermal: -1198.726261 hartree
zpe.sumelectthermalent: -1198.725317 hartree
zpe.sumelectthermalfe: -1198.796585 hartree
dipole: 2.0220 0.9994 1.5265
dipole: 2.7235
quadrupole: -108.6721 -125.1958 -117.1915
quadrupole: 3.8161 3.4029 0.3871
quadrupole: 8.3477 -8.1760 -0.1717 3.8161 3.4029 0.3871
hfenergy: -1199.0106148 hartree
pointgroup: C01 [X(C12H16N2O3S1)]
dipole: -0.7537491 0.4938271 -0.5797841 debye
polarizability: 201.5612039|-6.8746746|163.4597227|-18.4928243|0.8108298|155.5999748 unknown
InChI: InChI=1S/C12H16N2O3S/c1-4-6-12(8(3)18-7-5-2)9(15)13-11(17)14-10(12)16/h4-5,8,13-14H,1-2,6-7H2,3H3
charge 0 multiplicity 1
34 atoms
S  -2.274612 -0.593357 0.109742
O  0.281931 -0.71805 2.15979
O  2.204087 -0.423011 -2.16496
O  2.132526 3.263665 0.661337
N  1.038175 1.308265 1.339784
N  2.056994 1.42882 -0.787389
C  0.580458 -0.530794 -0.296272
C  -0.780989 -0.000723 -0.942634
C  0.689671 -2.084687 -0.329453
C  0.624761 -0.035862 1.169106
C  1.693831 0.116611 -1.150946
C  -0.982012 -0.400895 -2.414746
C  2.044891 -2.610293 0.109793
C  1.754366 2.090723 0.420625
C  -3.459977 0.871476 -0.260684
C  2.270657 -3.275792 1.269276
C  -4.881188 0.397712 -0.138435
C  -5.740626 0.813966 0.826343
H  -0.788849 1.102162 -0.845425
H  0.496449 -2.416849 -1.364573
H  -0.103536 -2.488981 0.323096
H  -1.091236 -1.492303 -2.521673
H  -1.910251 0.060289 -2.796636
H  -0.146047 -0.06902 -3.05613
H  0.930802 1.709565 2.277082
H  2.690039 1.930331 -1.419219
H  2.872679 -2.444416 -0.59448
H  -3.23315 1.68709 0.444666
H  -3.237671 1.195502 -1.293316
H  3.267498 -3.652539 1.526319
H  1.467907 -3.449017 1.995634
H  -5.209345 -0.337868 -0.885768
H  -6.770765 0.444722 0.872516
H  -5.436767 1.533357 1.596731
