program: Orca
programVersion: 5.0.2
elementType: N H C H C O C C O N H C H H H O H H S H C O C H H C H H C H N H H C O O H H
charge: 1
multiplicity: 1
keywords: wB97X-D3BJ Opt Freq def2-TZVPP def2/J RIJCOSX VeryTightSCF
keywords: PAL8 defgrid3 TightOpt
frequency: 0.00 0.00 0.00 0.00 0.00 0.00 24.28 37.69 43.78 57.71 61.11 70.23 84.32 88.68 93.95 114.15 136.37 160.76 196.64 206.14 213.20 239.89 263.51 291.13 302.12 321.59 336.30 357.11 400.21 412.18 425.88 487.86 516.49 522.83 536.08 554.82 578.32 596.48 602.46 630.62 634.74 652.63 671.48 710.33 727.90 746.18 768.50 776.35 841.30 846.00 876.96 906.00 910.86 932.06 948.21 970.44 1023.01 1024.87 1049.24 1071.40 1103.12 1127.67 1140.61 1151.24 1171.55 1208.45 1210.79 1216.27 1251.63 1279.98 1306.65 1311.60 1318.90 1341.90 1347.04 1357.58 1362.40 1376.01 1390.34 1408.31 1411.45 1437.50 1468.55 1483.41 1491.12 1496.66 1500.83 1551.65 1552.38 1593.02 1621.09 1675.39 1708.57 1794.35 1856.83 1875.62 2245.31 2767.43 3092.48 3098.64 3108.59 3112.13 3113.26 3122.45 3153.77 3157.01 3164.21 3209.69 3503.84 3573.33 3605.32 3616.26 3783.57 3790.72
frequency: 24.28 37.69 43.78 57.71 61.11 70.23 84.32 88.68 93.95 114.15 136.37 160.76 196.64 206.14 213.20 239.89 263.51 291.13 302.12 321.59 336.30 357.11 400.21 412.18 425.88 487.86 516.49 522.83 536.08 554.82 578.32 596.48 602.46 630.62 634.74 652.63 671.48 710.33 727.90 746.18 768.50 776.35 841.30 846.00 876.96 906.00 910.86 932.06 948.21 970.44 1023.01 1024.87 1049.24 1071.40 1103.12 1127.67 1140.61 1151.24 1171.55 1208.45 1210.79 1216.27 1251.63 1279.98 1306.65 1311.60 1318.90 1341.90 1347.04 1357.58 1362.40 1376.01 1390.34 1408.31 1411.45 1437.50 1468.55 1483.41 1491.12 1496.66 1500.83 1551.65 1552.38 1593.02 1621.09 1675.39 1708.57 1794.35 1856.83 1875.62 2245.31 2767.43 3092.48 3098.64 3108.59 3112.13 3113.26 3122.45 3153.77 3157.01 3164.21 3209.69 3503.84 3573.33 3605.32 3616.26 3783.57 3790.72
formula: C10H18N3O6S
InChI: InChI=1S/C10H18N3O6S/c11-5(10(18)19)1-2-7(14)13-6(4-20)9(17)12-3-8(15)16/h5-6,12-13,15,18,20H,1-4H2,11H3
38 atoms
N  -0.329116 -3.446269 -0.553477
H  -0.317063 -3.228852 -1.53903
C  0.352122 -4.669881 -0.151136
H  0.266746 -4.784876 0.925024
C  1.821505 -4.541152 -0.529427
O  2.738989 -4.454781 0.241807
C  -0.499258 -2.433286 0.3296
C  -0.950813 -1.073124 -0.238967
O  -0.327124 -2.53377 1.526337
N  0.025621 -0.015021 0.034763
H  -1.8206 -0.83344 0.377217
C  -1.420262 -1.02093 -1.696122
H  -0.360801 0.917567 0.078031
H  -2.1402 -1.820606 -1.869403
H  -1.923035 -0.069263 -1.866574
O  1.959963 -4.444747 -1.863128
H  2.885476 -4.245825 -2.065337
H  -0.091905 -5.525896 -0.659178
S  -0.028529 -1.170376 -2.858502
H  -0.76218 -1.26611 -3.971593
C  1.364437 -0.006928 0.059639
O  1.940576 1.098361 0.119158
C  2.133744 -1.305731 0.043908
H  1.74496 -1.925487 0.850832
H  1.910627 -1.832966 -0.884912
C  3.645998 -1.217444 0.252954
H  4.005751 -2.244326 0.317973
H  3.870425 -0.74503 1.212533
C  4.463432 -0.514436 -0.83343
H  5.516778 -0.779611 -0.717466
N  4.345483 0.972563 -0.695804
H  3.322523 1.160828 -0.340319
H  4.999178 1.322648 0.000056
C  4.07488 -0.97974 -2.231897
O  3.890206 -2.130637 -2.503832
O  3.996581 0.031431 -3.108416
H  3.775644 -0.323734 -3.981205
H  4.516205 1.449609 -1.579056
totalener: -1406.22957218 hartree
nucrepener: 1964.65935248 hartree
electener: -3370.88892466 hartree
oneelecener: -5812.90843012 hartree
twoeener: 2442.01950546 hartree
kineticenergy: 1400.65504192 hartree
exchangeener: -105.323668369376 hartree
correlationener: -7.059423871075 hartree
xcener: -112.383092240451 hartree
temp: 298.15 k
press: 1.00 atm
thermalcorrenthalpy: 0.00094421 hartree
totalenthalpy: -1405.98673734 hartree
totalentropycorr: -0.06492055 hartree
gibbsenthalpy: -1406.05165788 hartree
gibbsminuselec: 0.26301629 hartree
chargesum: 1.0000000
charge: -0.181908 0.186566 -0.062888 0.146452 0.286594 -0.303899 0.146316 0.002628 -0.313725 -0.141332 0.147513 -0.169242 0.188201 0.141529 0.129865 -0.268432 0.243621 0.139711 -0.188887 0.135879 0.288076 -0.392508 -0.169369 0.181936 0.060112 -0.242526 0.150657 0.135408 -0.013155 0.155283 -0.074640 0.222721 0.217063 0.321916 -0.296078 -0.276911 0.251786 0.215667
charge: 0.328388 -0.051558 -0.021141 0.040703 -0.443171 0.122966 -0.406581 -0.124293 0.112561 0.363846 0.053519 -0.224646 0.004387 0.012973 0.008685 0.363137 -0.091290 0.032860 0.483909 -0.138825 -0.319450 0.157742 -0.009329 0.048176 0.022941 0.009532 0.048275 0.037611 -0.053103 0.049626 0.586899 -0.092661 0.035804 -0.426614 0.149402 0.373423 -0.066908 0.022204
qa: -0.1819 0.1866 -0.0629 0.1465 0.2866 -0.3039 0.1463 0.0026 -0.3137 -0.1413 0.1475 -0.1692 0.1882 0.1415 0.1299 -0.2684 0.2436 0.1397 -0.1889 0.1359 0.2881 -0.3925 -0.1694 0.1819 0.0601 -0.2425 0.1507 0.1354 -0.0132 0.1553 -0.0746 0.2227 0.2171 0.3219 -0.2961 -0.2769 0.2518 0.2157
va: 3.1401 1.0451 3.7945 1.0315 4.2743 2.1857 4.3764 3.8721 2.2088 3.2284 1.0014 3.9580 1.0152 1.0071 1.0050 2.1980 1.0226 0.9986 2.1678 1.0154 4.2292 2.1183 3.6617 1.0274 1.0529 3.9180 1.0283 1.0067 3.8247 0.9995 3.5083 1.1112 0.9842 4.3118 2.2012 2.2136 1.0108 1.0032
dispcorr: -0.085602951 hartree
energy: -1406.320304357311
dipole: 0.71785 0.75966 1.47752 4.63153 -1.86697 2.76456 0.32117 -1.96399 -1.64281
magnitude: 3.53903 au
magnitude: 8.99549 debye
zeropoint: 0.31022215 hartree
thermalvibcorrection: 0.01822715 hartree
thermalrotcorrection: 0.00141627 hartree
thermaltrasncorrection: 0.00141627 hartree
thermaltotal: -1405.98902252 hartree
thermalcorr: 0.02105969 hartree
nonthermalcorr: 0.31022215 hartree
totalcorr: 0.33128184 hartree
totalenthalpy: -1405.98807831 hartree
