program: Orca
programVersion: 5.0.2
elementType: N H C H C O C C O N H C H H H O H H S H C O C H H C H H C H N H H C O O H H
charge: 1
multiplicity: 1
keywords: wB97X-D3BJ Opt Freq def2-TZVPP def2/J RIJCOSX VeryTightSCF
keywords: PAL8 defgrid3 TightOpt
frequency: 0.00 0.00 0.00 0.00 0.00 0.00 23.74 36.82 46.72 54.18 67.38 76.25 80.03 95.34 99.73 125.57 142.24 169.43 173.74 209.10 223.25 241.96 255.55 261.92 279.69 286.78 316.94 331.36 338.48 347.61 423.51 435.50 477.91 492.38 510.08 528.11 553.32 573.74 627.00 651.81 662.39 669.97 699.68 722.04 750.97 756.91 792.10 815.60 826.57 862.44 889.67 903.14 915.96 960.26 991.38 1001.60 1011.79 1034.89 1042.05 1063.54 1087.04 1115.04 1142.97 1162.77 1202.47 1217.09 1220.40 1228.38 1256.32 1286.83 1295.47 1298.64 1321.12 1330.67 1355.31 1358.81 1363.39 1376.59 1404.66 1415.43 1456.39 1464.22 1465.75 1475.97 1483.58 1489.24 1504.74 1515.24 1521.86 1554.35 1640.31 1677.31 1776.93 1784.19 1795.69 1824.36 2751.19 2968.48 3066.52 3085.57 3102.75 3105.02 3124.28 3136.94 3156.19 3156.86 3175.87 3182.42 3221.09 3503.38 3560.71 3646.89 3697.87 3791.21
frequency: 23.74 36.82 46.72 54.18 67.38 76.25 80.03 95.34 99.73 125.57 142.24 169.43 173.74 209.10 223.25 241.96 255.55 261.92 279.69 286.78 316.94 331.36 338.48 347.61 423.51 435.50 477.91 492.38 510.08 528.11 553.32 573.74 627.00 651.81 662.39 669.97 699.68 722.04 750.97 756.91 792.10 815.60 826.57 862.44 889.67 903.14 915.96 960.26 991.38 1001.60 1011.79 1034.89 1042.05 1063.54 1087.04 1115.04 1142.97 1162.77 1202.47 1217.09 1220.40 1228.38 1256.32 1286.83 1295.47 1298.64 1321.12 1330.67 1355.31 1358.81 1363.39 1376.59 1404.66 1415.43 1456.39 1464.22 1465.75 1475.97 1483.58 1489.24 1504.74 1515.24 1521.86 1554.35 1640.31 1677.31 1776.93 1784.19 1795.69 1824.36 2751.19 2968.48 3066.52 3085.57 3102.75 3105.02 3124.28 3136.94 3156.19 3156.86 3175.87 3182.42 3221.09 3503.38 3560.71 3646.89 3697.87 3791.21
formula: C10H18N3O6S
InChI: InChI=1S/C10H18N3O6S/c11-5(10(18)19)1-2-7(14)13-6(4-20)9(17)12-3-8(15)16/h5-6,12-13,15,18,20H,1-4H2,11H3
38 atoms
N  -1.149049 -1.104905 2.391161
H  -0.950176 -0.122077 2.339884
C  -1.661965 -1.688061 3.603954
H  -1.912926 -0.894746 4.311103
C  -0.687624 -2.614081 4.307017
O  0.524997 -2.547065 4.257143
C  -1.076544 -1.87155 1.268487
C  -0.899937 -1.112049 -0.06048
O  -1.228614 -3.075411 1.309723
N  0.029756 0.002629 0.039631
H  -1.872241 -0.639638 -0.227975
C  -0.693912 -2.109228 -1.20971
H  -0.340322 0.92206 -0.142571
H  0.078431 -2.836257 -0.968193
H  -1.608565 -2.684998 -1.33012
O  -1.316039 -3.504294 5.05369
H  -0.661924 -4.047098 5.516524
H  -2.569617 -2.257915 3.402846
S  -0.207729 -1.362077 -2.776534
H  -1.324366 -0.656582 -2.991839
C  1.392376 -0.007903 0.007672
O  2.021649 1.036079 -0.011534
C  2.108897 -1.345934 -0.005598
H  2.030423 -1.743084 -1.019271
H  1.623601 -2.061603 0.657683
C  3.594724 -1.192521 0.315567
H  4.067211 -0.611694 -0.479542
H  4.049846 -2.188057 0.336072
C  3.886838 -0.481262 1.641959
H  3.595016 0.564128 1.577917
N  5.360521 -0.581891 1.940804
H  5.435094 -1.37402 2.609241
H  5.914968 -0.759127 1.10487
C  3.21722 -1.186561 2.818668
O  3.861418 -1.93363 3.523412
O  1.947917 -0.908437 2.892577
H  1.434058 -1.526768 3.502609
H  5.718981 0.255131 2.397879
totalener: -1406.23347843 hartree
nucrepener: 1896.93623005 hartree
electener: -3303.16970847 hartree
oneelecener: -5678.83248402 hartree
twoeener: 2375.66277555 hartree
kineticenergy: 1400.63740068 hartree
exchangeener: -105.325956906598 hartree
correlationener: -7.056243727905 hartree
xcener: -112.382200634503 hartree
temp: 298.15 k
press: 1.00 atm
thermalcorrenthalpy: 0.00094421 hartree
totalenthalpy: -1405.98634223 hartree
totalentropycorr: -0.06536788 hartree
gibbsenthalpy: -1406.05171011 hartree
gibbsminuselec: 0.26274964 hartree
chargesum: 1.0000000
charge: -0.207413 0.186409 -0.095138 0.138813 0.366336 -0.341237 0.179322 0.020232 -0.338184 -0.225494 0.128274 -0.138214 0.195656 0.113784 0.147856 -0.228724 0.247126 0.146108 -0.138090 0.099172 0.247922 -0.366477 -0.191557 0.128805 0.120058 -0.222093 0.135886 0.131243 -0.031468 0.181382 -0.042907 0.233247 0.232306 0.304039 -0.319904 -0.298269 0.261722 0.239472
charge: 0.323346 -0.030149 -0.041775 0.042963 -0.392566 0.185522 -0.381954 -0.146217 0.112392 0.323603 0.044534 -0.250403 -0.014690 0.007992 0.016326 0.411882 -0.068244 0.044533 0.491914 -0.148222 -0.381566 0.084492 -0.007665 0.038251 0.030331 -0.003456 0.037647 0.032792 -0.038671 0.037276 0.615051 0.032382 0.049537 -0.459085 0.125892 0.392204 -0.170669 0.054469
qa: -0.2074 0.1864 -0.0951 0.1388 0.3663 -0.3412 0.1793 0.0202 -0.3382 -0.2255 0.1283 -0.1382 0.1957 0.1138 0.1479 -0.2287 0.2471 0.1461 -0.1381 0.0992 0.2479 -0.3665 -0.1916 0.1288 0.1201 -0.2221 0.1359 0.1312 -0.0315 0.1814 -0.0429 0.2332 0.2323 0.3040 -0.3199 -0.2983 0.2617 0.2395
va: 3.1261 1.0194 3.8865 1.0002 4.1672 2.1479 4.3231 3.8193 2.1859 3.0551 0.9880 3.9770 1.0106 1.0063 1.0078 2.2963 1.0118 1.0165 2.1634 1.0250 4.2673 2.1484 3.8418 1.0174 1.0150 3.9496 1.0047 1.0014 3.8079 1.0249 3.6172 1.0257 0.9750 4.3057 2.1771 2.2175 1.0789 0.9719
dispcorr: -0.081289809 hartree
energy: -1406.320294208171
dipole: 6.07603 -2.97372 3.10231 2.18078 -0.91079 1.26999 -3.30371 4.57566 1.27195
magnitude: 3.58540 au
magnitude: 9.11336 debye
zeropoint: 0.31036129 hartree
thermalvibcorrection: 0.01851178 hartree
thermalrotcorrection: 0.00141627 hartree
thermaltrasncorrection: 0.00141627 hartree
thermaltotal: -1405.98858859 hartree
thermalcorr: 0.02134432 hartree
nonthermalcorr: 0.31036129 hartree
totalcorr: 0.33170561 hartree
totalenthalpy: -1405.98764439 hartree
