program: Orca
programVersion: 5.0.2
elementType: N H C H C O C C O N H C H H H O H H S H C O C H H C H H C H N H H C O O H H
charge: 1
multiplicity: 1
keywords: wB97X-D3BJ Opt Freq def2-TZVPP def2/J RIJCOSX VeryTightSCF
keywords: PAL8 defgrid3 TightOpt
frequency: 0.00 0.00 0.00 0.00 0.00 0.00 16.69 20.52 26.28 42.03 53.97 60.51 71.06 81.48 112.97 148.09 156.49 172.39 187.31 205.25 215.63 227.26 263.41 286.87 292.43 298.76 319.24 350.12 370.87 386.51 408.04 437.91 488.16 510.59 527.84 542.59 583.09 589.46 599.50 642.90 653.71 683.34 693.11 710.60 729.41 757.63 773.15 788.32 844.66 858.77 861.42 879.05 918.64 931.20 943.81 972.27 1036.60 1050.69 1055.74 1111.20 1117.92 1125.25 1146.82 1167.44 1189.56 1200.60 1203.16 1213.66 1242.07 1297.84 1299.75 1302.40 1307.54 1313.23 1357.15 1369.46 1370.05 1379.65 1386.17 1405.54 1421.84 1450.40 1453.71 1472.06 1494.32 1501.38 1503.59 1516.89 1523.85 1620.36 1634.50 1688.90 1722.64 1758.33 1850.06 1878.38 2763.93 3095.40 3102.54 3105.04 3107.35 3118.62 3122.01 3156.87 3164.08 3164.96 3170.71 3174.14 3401.66 3467.58 3544.50 3602.53 3786.54 3802.16
frequency: 16.69 20.52 26.28 42.03 53.97 60.51 71.06 81.48 112.97 148.09 156.49 172.39 187.31 205.25 215.63 227.26 263.41 286.87 292.43 298.76 319.24 350.12 370.87 386.51 408.04 437.91 488.16 510.59 527.84 542.59 583.09 589.46 599.50 642.90 653.71 683.34 693.11 710.60 729.41 757.63 773.15 788.32 844.66 858.77 861.42 879.05 918.64 931.20 943.81 972.27 1036.60 1050.69 1055.74 1111.20 1117.92 1125.25 1146.82 1167.44 1189.56 1200.60 1203.16 1213.66 1242.07 1297.84 1299.75 1302.40 1307.54 1313.23 1357.15 1369.46 1370.05 1379.65 1386.17 1405.54 1421.84 1450.40 1453.71 1472.06 1494.32 1501.38 1503.59 1516.89 1523.85 1620.36 1634.50 1688.90 1722.64 1758.33 1850.06 1878.38 2763.93 3095.40 3102.54 3105.04 3107.35 3118.62 3122.01 3156.87 3164.08 3164.96 3170.71 3174.14 3401.66 3467.58 3544.50 3602.53 3786.54 3802.16
formula: C10H18N3O6S
InChI: InChI=1S/C10H18N3O6S/c11-5(10(18)19)1-2-7(14)13-6(4-20)9(17)12-3-8(15)16/h5-6,12-13,15,18,20H,1-4H2,11H3
38 atoms
N  -1.921342 -1.823222 -2.553807
H  -2.65266 -2.242211 -1.993845
C  -2.018474 -1.822577 -3.999081
H  -1.106667 -2.206857 -4.45305
C  -2.271256 -0.448017 -4.601983
O  -1.949376 -0.150421 -5.715281
C  -0.941565 -1.156043 -1.94806
C  -0.931689 -1.125787 -0.401344
O  -0.053664 -0.590464 -2.591298
N  -0.078868 -0.049181 0.054002
H  -0.511586 -2.076908 -0.064699
C  -2.322295 -0.952187 0.22978
H  -0.491591 0.873983 0.035511
H  -2.186781 -0.592476 1.247944
H  -2.903559 -0.22071 -0.332981
O  -2.931847 0.374392 -3.763786
H  -3.094035 1.196734 -4.245568
H  -2.845127 -2.471004 -4.291259
S  -3.197268 -2.543385 0.269604
H  -4.423903 -2.049042 0.467784
C  1.274573 -0.000929 -0.04909
O  1.854287 1.079563 -0.083681
C  2.083799 -1.284274 -0.075438
H  2.888319 -1.11466 0.642555
H  1.513879 -2.143918 0.274028
C  2.698969 -1.622021 -1.443864
H  1.942963 -2.018853 -2.123199
H  3.438762 -2.40762 -1.294413
C  3.412835 -0.456471 -2.131057
H  4.07038 0.052746 -1.42352
N  2.454814 0.563065 -2.66658
H  2.795779 0.874946 -3.582203
H  2.364831 1.329496 -1.994929
C  4.262732 -0.889683 -3.323208
O  4.16795 -0.370731 -4.404613
O  5.111262 -1.858761 -3.006682
H  5.650411 -2.069758 -3.78276
H  1.503529 0.158238 -2.767681
totalener: -1406.24847205 hartree
nucrepener: 1833.66381422 hartree
electener: -3239.91228627 hartree
oneelecener: -5550.78525671 hartree
twoeener: 2310.87297044 hartree
kineticenergy: 1400.66876252 hartree
exchangeener: -105.328120786732 hartree
correlationener: -7.053897358483 hartree
xcener: -112.382018145216 hartree
temp: 298.15 k
press: 1.00 atm
thermalcorrenthalpy: 0.00094421 hartree
totalenthalpy: -1405.99796572 hartree
totalentropycorr: -0.06585248 hartree
gibbsenthalpy: -1406.06381820 hartree
gibbsminuselec: 0.26401324 hartree
chargesum: 1.0000000
charge: -0.162675 0.181089 -0.079470 0.130867 0.288699 -0.276587 0.299614 0.072990 -0.491437 -0.155215 0.109124 -0.199600 0.177923 0.144344 0.143251 -0.281328 0.237032 0.131751 -0.132344 0.131456 0.162189 -0.384684 -0.112270 0.146937 0.108886 -0.257401 0.108446 0.147030 0.016239 0.151044 -0.057418 0.224311 0.235958 0.301115 -0.298957 -0.245551 0.254612 0.230033
charge: 0.350804 -0.061813 -0.028475 0.038874 -0.443172 0.137872 -0.356432 -0.138468 0.092748 0.337504 0.034346 -0.219625 -0.001854 0.010663 0.009890 0.350819 -0.083359 0.041785 0.523136 -0.135874 -0.375938 0.072806 0.001820 0.047631 0.027286 -0.000760 0.026753 0.041144 -0.043302 0.050685 0.614271 0.027735 0.023309 -0.429156 0.139525 0.399989 -0.063908 -0.019258
qa: -0.1627 0.1811 -0.0795 0.1309 0.2887 -0.2766 0.2996 0.0730 -0.4914 -0.1552 0.1091 -0.1996 0.1779 0.1443 0.1433 -0.2813 0.2370 0.1318 -0.1323 0.1315 0.1622 -0.3847 -0.1123 0.1469 0.1089 -0.2574 0.1084 0.1470 0.0162 0.1510 -0.0574 0.2243 0.2360 0.3011 -0.2990 -0.2456 0.2546 0.2300
va: 3.2322 1.0746 3.8255 1.0224 4.2951 2.2331 4.0879 3.9003 1.9908 3.1453 1.0001 3.9845 1.0257 1.0009 0.9950 2.1733 1.0186 0.9992 2.2002 1.0162 4.3116 2.1056 3.7936 1.0148 1.0153 3.9147 1.0151 1.0182 3.8518 1.0133 3.5853 1.0104 1.0058 4.3366 2.1929 2.2635 1.0054 1.0641
dispcorr: -0.080286348 hartree
energy: -1406.333905457372
dipole: 1.80683 -1.13681 0.67002 -1.79690 1.43269 -0.36421 5.92606 -5.01250 0.91356
magnitude: 1.19003 au
magnitude: 3.02482 debye
zeropoint: 0.31139518 hartree
thermalvibcorrection: 0.01848191 hartree
thermalrotcorrection: 0.00141627 hartree
thermaltrasncorrection: 0.00141627 hartree
thermaltotal: -1406.00119583 hartree
thermalcorr: 0.02131445 hartree
nonthermalcorr: 0.31139518 hartree
totalcorr: 0.33270963 hartree
totalenthalpy: -1406.00025162 hartree
