program: Orca
programVersion: 5.0.2
elementType: N H C H C O C C O N H C H H H O H H S H C O C H H C H H C H N H H C O O H H
charge: 1
multiplicity: 1
keywords: wB97X-D3BJ Opt Freq def2-TZVPP def2/J RIJCOSX VeryTightSCF
keywords: PAL8 defgrid3 TightOpt
frequency: 0.00 0.00 0.00 0.00 0.00 0.00 27.64 30.18 39.53 58.50 67.92 76.73 97.04 104.97 125.51 135.10 148.79 157.54 170.67 188.92 217.52 232.23 237.36 246.46 257.49 288.45 318.62 325.12 333.35 361.49 410.27 465.88 502.06 514.11 521.18 534.37 555.81 602.37 627.15 634.85 661.79 665.57 674.86 690.21 715.63 747.74 748.84 776.70 821.82 847.47 864.46 900.80 923.89 936.05 945.10 976.14 985.29 1045.00 1060.48 1084.98 1100.06 1136.66 1148.32 1163.42 1170.52 1203.19 1212.30 1245.69 1247.95 1264.48 1308.03 1313.01 1321.40 1339.39 1342.30 1357.40 1361.27 1375.52 1385.32 1414.75 1453.01 1458.81 1469.17 1471.42 1491.14 1492.28 1498.50 1516.53 1567.56 1625.49 1646.64 1673.18 1725.83 1786.93 1825.81 1843.24 2770.57 3086.26 3097.69 3099.07 3108.00 3129.09 3150.15 3159.49 3166.90 3168.70 3172.67 3233.33 3381.17 3434.29 3541.72 3609.79 3788.81 3797.15
frequency: 27.64 30.18 39.53 58.50 67.92 76.73 97.04 104.97 125.51 135.10 148.79 157.54 170.67 188.92 217.52 232.23 237.36 246.46 257.49 288.45 318.62 325.12 333.35 361.49 410.27 465.88 502.06 514.11 521.18 534.37 555.81 602.37 627.15 634.85 661.79 665.57 674.86 690.21 715.63 747.74 748.84 776.70 821.82 847.47 864.46 900.80 923.89 936.05 945.10 976.14 985.29 1045.00 1060.48 1084.98 1100.06 1136.66 1148.32 1163.42 1170.52 1203.19 1212.30 1245.69 1247.95 1264.48 1308.03 1313.01 1321.40 1339.39 1342.30 1357.40 1361.27 1375.52 1385.32 1414.75 1453.01 1458.81 1469.17 1471.42 1491.14 1492.28 1498.50 1516.53 1567.56 1625.49 1646.64 1673.18 1725.83 1786.93 1825.81 1843.24 2770.57 3086.26 3097.69 3099.07 3108.00 3129.09 3150.15 3159.49 3166.90 3168.70 3172.67 3233.33 3381.17 3434.29 3541.72 3609.79 3788.81 3797.15
formula: C10H18N3O6S
InChI: InChI=1S/C10H18N3O6S/c11-5(10(18)19)1-2-7(14)13-6(4-20)9(17)12-3-8(15)16/h5-6,12-13,15,18,20H,1-4H2,11H3
38 atoms
N  -1.580791 -0.439966 -2.721008
H  -2.235262 0.17303 -2.252114
C  -1.53059 -0.437599 -4.162194
H  -1.478073 -1.461195 -4.541972
C  -0.329802 0.299834 -4.729592
O  0.666048 0.604922 -4.114574
C  -0.761292 -1.200396 -1.986312
C  -0.842362 -1.105431 -0.449097
O  0.071629 -1.949387 -2.502169
N  0.103525 -0.115909 0.036559
H  -0.536634 -2.092153 -0.101121
C  -2.233328 -0.859411 0.139582
H  -0.237461 0.82201 0.195108
H  -2.941992 -1.548273 -0.318719
H  -2.187869 -1.059677 1.208859
O  -0.501761 0.545175 -6.023744
H  0.280674 0.996391 -6.370019
H  -2.439869 0.013145 -4.556582
S  -2.794161 0.857318 -0.110709
H  -4.03037 0.687719 0.367522
C  1.461428 -0.21999 0.152432
O  2.133912 0.758251 0.415091
C  2.113014 -1.581434 -0.036659
H  2.206268 -2.029038 0.956407
H  1.495208 -2.255444 -0.625673
C  3.513842 -1.444183 -0.638603
H  3.917276 -2.438245 -0.849669
H  4.177532 -0.961445 0.077088
C  3.556138 -0.582685 -1.904175
H  3.270681 0.437872 -1.652069
N  2.637748 -1.082179 -2.974142
H  3.190206 -1.663322 -3.613746
H  1.812831 -1.600321 -2.624912
C  4.947459 -0.59567 -2.52106
O  5.183408 -1.14493 -3.567683
O  5.833247 0.031689 -1.762581
H  6.704743 -0.025696 -2.180205
H  2.226957 -0.311434 -3.513881
totalener: -1406.25682149 hartree
nucrepener: 1877.52029712 hartree
electener: -3283.77711861 hartree
oneelecener: -5638.31437756 hartree
twoeener: 2354.53725895 hartree
kineticenergy: 1401.50357497 hartree
exchangeener: -105.479039999286 hartree
correlationener: -7.065323413775 hartree
xcener: -112.544363413061 hartree
temp: 298.15 k
press: 1.00 atm
thermalcorrenthalpy: 0.00094421 hartree
totalenthalpy: -1406.00547281 hartree
totalentropycorr: -0.06896708 hartree
gibbsenthalpy: -1406.07443989 hartree
gibbsminuselec: 0.26348419 hartree
chargesum: 1.0000000
charge: -0.154008 0.178193 -0.094441 0.143338 0.342844 -0.390930 0.300657 -0.016554 -0.464924 -0.167224 0.147919 -0.194919 0.180835 0.137803 0.145742 -0.232194 0.244251 0.152236 -0.147871 0.133081 0.215977 -0.336386 -0.207953 0.136875 0.088028 -0.195194 0.125347 0.147822 0.003612 0.167922 -0.074901 0.216252 0.233971 0.283307 -0.308868 -0.232320 0.250852 0.241826
charge: 0.348754 -0.064995 -0.031480 0.046901 -0.414703 0.099950 -0.355136 -0.143827 0.078687 0.327478 0.045242 -0.210563 -0.022811 0.012735 0.014214 0.398740 -0.073500 0.043685 0.510644 -0.133891 -0.383565 0.099535 -0.009599 0.045600 0.011380 0.004048 0.033931 0.047232 -0.049854 0.044801 0.612907 0.031493 -0.013309 -0.434229 0.127799 0.408219 -0.065254 0.012741
qa: -0.1540 0.1782 -0.0944 0.1433 0.3428 -0.3909 0.3007 -0.0166 -0.4649 -0.1672 0.1479 -0.1949 0.1808 0.1378 0.1457 -0.2322 0.2443 0.1522 -0.1479 0.1331 0.2160 -0.3364 -0.2080 0.1369 0.0880 -0.1952 0.1253 0.1478 0.0036 0.1679 -0.0749 0.2163 0.2340 0.2833 -0.3089 -0.2323 0.2509 0.2418
va: 3.2062 1.0752 3.8082 1.0112 4.2477 2.0868 4.1114 3.9248 2.0293 3.0922 0.9929 3.9831 1.0380 0.9963 0.9977 2.2700 1.0143 1.0071 2.2064 1.0149 4.2982 2.1816 3.8073 1.0085 1.0398 3.8996 1.0063 1.0194 3.7757 1.0293 3.6047 1.0169 1.0483 4.3751 2.1841 2.2825 1.0073 1.0186
dispcorr: -0.081178504 hartree
energy: -1406.338245180284
dipole: -2.35475 1.74031 -0.61444 -6.81572 5.85615 -0.95956 3.55313 -4.44885 -0.89572
magnitude: 1.44935 au
magnitude: 3.68395 debye
zeropoint: 0.31105966 hartree
thermalvibcorrection: 0.01856162 hartree
thermalrotcorrection: 0.00141627 hartree
thermaltrasncorrection: 0.00141627 hartree
thermaltotal: -1406.00579136 hartree
thermalcorr: 0.02139416 hartree
nonthermalcorr: 0.31105966 hartree
totalcorr: 0.33245382 hartree
totalenthalpy: -1406.00484715 hartree
