program: Orca
programVersion: 5.0.2
elementType: N H C H C O C C O N H C H H H O H H S H C O C H H C H H C H N H H C O O H H
charge: 1
multiplicity: 1
keywords: wB97X-D3BJ Opt Freq def2-TZVPP def2/J RIJCOSX VeryTightSCF
keywords: PAL8 defgrid3 TightOpt
frequency: 0.00 0.00 0.00 0.00 0.00 0.00 16.90 21.66 26.52 34.37 41.19 54.27 58.08 73.90 83.74 132.87 142.68 170.57 185.98 197.06 230.78 237.12 242.13 251.46 290.81 302.27 319.61 345.91 361.79 385.44 400.27 448.65 515.91 523.26 524.67 531.65 576.41 595.37 598.52 636.87 649.72 664.64 666.58 696.00 721.42 739.18 757.76 774.95 808.05 848.93 866.88 907.29 920.11 944.78 972.05 1006.81 1019.84 1027.47 1054.68 1070.42 1108.68 1130.82 1141.58 1167.91 1197.89 1208.17 1212.86 1224.39 1250.07 1258.42 1263.89 1291.52 1298.33 1328.90 1334.05 1350.32 1363.34 1376.51 1422.00 1426.75 1436.69 1462.23 1464.51 1473.28 1493.43 1494.65 1498.30 1531.48 1541.12 1587.58 1649.02 1664.42 1715.87 1751.28 1851.96 1892.05 2720.89 2759.72 3084.74 3090.61 3092.60 3113.34 3118.43 3120.29 3132.28 3155.62 3169.82 3193.06 3506.47 3567.71 3613.42 3631.29 3787.58 3798.66
frequency: 16.90 21.66 26.52 34.37 41.19 54.27 58.08 73.90 83.74 132.87 142.68 170.57 185.98 197.06 230.78 237.12 242.13 251.46 290.81 302.27 319.61 345.91 361.79 385.44 400.27 448.65 515.91 523.26 524.67 531.65 576.41 595.37 598.52 636.87 649.72 664.64 666.58 696.00 721.42 739.18 757.76 774.95 808.05 848.93 866.88 907.29 920.11 944.78 972.05 1006.81 1019.84 1027.47 1054.68 1070.42 1108.68 1130.82 1141.58 1167.91 1197.89 1208.17 1212.86 1224.39 1250.07 1258.42 1263.89 1291.52 1298.33 1328.90 1334.05 1350.32 1363.34 1376.51 1422.00 1426.75 1436.69 1462.23 1464.51 1473.28 1493.43 1494.65 1498.30 1531.48 1541.12 1587.58 1649.02 1664.42 1715.87 1751.28 1851.96 1892.05 2720.89 2759.72 3084.74 3090.61 3092.60 3113.34 3118.43 3120.29 3132.28 3155.62 3169.82 3193.06 3506.47 3567.71 3613.42 3631.29 3787.58 3798.66
formula: C10H18N3O6S
InChI: InChI=1S/C10H18N3O6S/c11-5(10(18)19)1-2-7(14)13-6(4-20)9(17)12-3-8(15)16/h5-6,12-13,15,18,20H,1-4H2,11H3
38 atoms
N  -1.30086 -2.209403 2.631713
H  -2.185833 -2.484782 2.229951
C  -1.071483 -2.660695 3.985599
H  -0.152654 -3.245955 4.061436
C  -2.248968 -3.520943 4.392482
O  -3.190721 -3.742185 3.676954
C  -0.429553 -1.437408 1.97349
C  -0.855226 -1.057716 0.535127
O  0.626184 -1.052365 2.46383
N  0.012455 -0.01065 0.023604
H  -1.845532 -0.603491 0.60153
C  -0.998699 -2.274496 -0.389797
H  -0.367719 0.923734 0.051552
H  -0.0636 -2.818891 -0.501111
H  -1.714722 -2.972076 0.045632
O  -2.105921 -3.992005 5.630559
H  -2.881365 -4.529372 5.843968
H  -0.980296 -1.821943 4.679645
S  -1.682281 -1.852671 -2.005239
H  -0.669125 -1.078828 -2.410001
C  1.358192 -0.004517 0.007808
O  1.958083 1.08059 -0.011174
C  2.122033 -1.308625 -0.096541
H  1.638518 -2.084231 0.48903
H  2.072575 -1.615529 -1.145922
C  3.589756 -1.204843 0.320629
H  4.146229 -0.565597 -0.369611
H  4.029278 -2.19993 0.261108
C  3.788169 -0.702955 1.75708
H  2.935306 -1.001664 2.370634
N  3.825995 0.798279 1.773881
H  4.750383 1.140847 1.517573
H  3.108999 1.119401 1.054812
C  5.036363 -1.298195 2.395778
O  5.241299 -2.472903 2.437924
O  5.851247 -0.353913 2.903125
H  6.616571 -0.791385 3.303077
H  3.605128 1.173672 2.69341
totalener: -1406.24442629 hartree
nucrepener: 1793.52860983 hartree
electener: -3199.77303612 hartree
oneelecener: -5471.35167724 hartree
twoeener: 2271.57864113 hartree
kineticenergy: 1400.65323710 hartree
exchangeener: -105.326134695752 hartree
correlationener: -7.051804859727 hartree
xcener: -112.377939555479 hartree
temp: 298.15 k
press: 1.00 atm
thermalcorrenthalpy: 0.00094421 hartree
totalenthalpy: -1405.99313429 hartree
totalentropycorr: -0.06649589 hartree
gibbsenthalpy: -1406.05963018 hartree
gibbsminuselec: 0.26239986 hartree
chargesum: 1.0000000
charge: -0.180578 0.184879 -0.065963 0.127319 0.304146 -0.319470 0.257228 0.040268 -0.434265 -0.183403 0.142154 -0.171930 0.190233 0.118350 0.125815 -0.254049 0.245931 0.129534 -0.109151 0.097930 0.260465 -0.396507 -0.164439 0.106155 0.139529 -0.234563 0.129412 0.141394 0.010518 0.153402 -0.056093 0.217581 0.229506 0.280948 -0.252962 -0.290786 0.254108 0.227354
charge: 0.343158 -0.020320 -0.028961 0.037193 -0.433580 0.118513 -0.376576 -0.138841 0.058167 0.350521 0.043898 -0.250231 -0.000829 -0.000988 0.014022 0.383311 -0.074565 0.038328 0.501388 -0.154187 -0.335726 0.120072 -0.005728 0.028642 0.045152 0.010135 0.033638 0.044620 -0.043973 0.047060 0.602079 0.038797 -0.054383 -0.434451 0.164544 0.354434 -0.068113 0.043777
qa: -0.1806 0.1849 -0.0660 0.1273 0.3041 -0.3195 0.2572 0.0403 -0.4343 -0.1834 0.1422 -0.1719 0.1902 0.1184 0.1258 -0.2540 0.2459 0.1295 -0.1092 0.0979 0.2605 -0.3965 -0.1644 0.1062 0.1395 -0.2346 0.1294 0.1414 0.0105 0.1534 -0.0561 0.2176 0.2295 0.2809 -0.2530 -0.2908 0.2541 0.2274
va: 3.2125 1.0397 3.8740 1.0075 4.3278 2.1710 4.1799 3.8455 2.0604 3.1915 1.0072 3.9891 1.0147 0.9955 1.0118 2.2413 1.0116 1.0066 2.1749 1.0319 4.2206 2.0995 3.8120 1.0195 1.0009 3.9689 1.0065 1.0191 3.6953 1.0397 3.5958 0.9959 1.0892 4.3916 2.2518 2.1972 1.0086 0.9816
dispcorr: -0.078202789 hartree
energy: -1406.327256441536
dipole: 6.47879 -4.03562 2.44316 3.04275 -1.37185 1.67090 -2.55701 3.57688 1.01987
magnitude: 3.13067 au
magnitude: 7.95753 debye
zeropoint: 0.31027976 hartree
thermalvibcorrection: 0.01878528 hartree
thermalrotcorrection: 0.00141627 hartree
thermaltrasncorrection: 0.00141627 hartree
thermaltotal: -1405.99535886 hartree
thermalcorr: 0.02161782 hartree
nonthermalcorr: 0.31027976 hartree
totalcorr: 0.33189758 hartree
totalenthalpy: -1405.99441465 hartree
