program: Orca
programVersion: 5.0.2
elementType: N H C H C O C C O N H C H H H O H H S H C O C H H C H H C H N H H C O O H H
charge: 1
multiplicity: 1
keywords: wB97X-D3BJ Opt Freq def2-TZVPP def2/J RIJCOSX VeryTightSCF
keywords: PAL8 defgrid3 TightOpt
frequency: 0.00 0.00 0.00 0.00 0.00 0.00 34.42 45.93 49.54 66.64 67.80 85.26 96.57 107.29 116.30 128.21 135.87 167.50 182.63 206.33 209.76 230.78 245.15 269.19 278.73 291.30 300.74 314.70 336.40 354.41 402.53 438.03 472.99 506.57 514.04 518.57 582.40 592.55 627.55 639.43 664.27 681.48 723.87 736.65 768.78 773.47 787.78 793.44 810.66 836.74 864.71 886.45 907.27 924.07 955.32 994.69 1018.44 1046.04 1066.07 1075.62 1097.12 1107.57 1127.87 1147.13 1184.80 1208.19 1227.03 1242.10 1256.68 1267.06 1272.33 1301.38 1308.60 1328.53 1346.24 1369.86 1383.68 1390.75 1397.09 1423.60 1435.49 1444.07 1471.81 1476.91 1477.58 1499.43 1506.25 1511.00 1568.80 1587.51 1659.02 1685.11 1725.38 1809.83 1830.86 1837.99 2752.06 3087.10 3102.67 3116.41 3119.47 3120.99 3137.16 3140.48 3153.47 3172.76 3179.92 3192.30 3251.72 3544.06 3635.26 3682.82 3697.11 3776.20
frequency: 34.42 45.93 49.54 66.64 67.80 85.26 96.57 107.29 116.30 128.21 135.87 167.50 182.63 206.33 209.76 230.78 245.15 269.19 278.73 291.30 300.74 314.70 336.40 354.41 402.53 438.03 472.99 506.57 514.04 518.57 582.40 592.55 627.55 639.43 664.27 681.48 723.87 736.65 768.78 773.47 787.78 793.44 810.66 836.74 864.71 886.45 907.27 924.07 955.32 994.69 1018.44 1046.04 1066.07 1075.62 1097.12 1107.57 1127.87 1147.13 1184.80 1208.19 1227.03 1242.10 1256.68 1267.06 1272.33 1301.38 1308.60 1328.53 1346.24 1369.86 1383.68 1390.75 1397.09 1423.60 1435.49 1444.07 1471.81 1476.91 1477.58 1499.43 1506.25 1511.00 1568.80 1587.51 1659.02 1685.11 1725.38 1809.83 1830.86 1837.99 2752.06 3087.10 3102.67 3116.41 3119.47 3120.99 3137.16 3140.48 3153.47 3172.76 3179.92 3192.30 3251.72 3544.06 3635.26 3682.82 3697.11 3776.20
formula: C10H18N3O6S
InChI: InChI=1S/C10H18N3O6S/c11-5(10(18)19)1-2-7(14)13-6(4-20)9(17)12-3-8(15)16/h5-6,12-13,15,18,20H,1-4H2,11H3
38 atoms
N  -1.766887 -1.93874 1.832247
H  -2.27904 -1.076289 1.901032
C  -1.91641 -2.942905 2.872421
H  -2.660195 -2.591616 3.587376
C  -0.61436 -3.213999 3.60962
O  -0.11627 -4.309773 3.710105
C  -0.949816 -2.146146 0.789228
C  -0.92772 -1.063552 -0.298064
O  -0.268349 -3.171513 0.715368
N  0.026399 -0.008532 0.015332
H  -1.902996 -0.57308 -0.271775
C  -0.771942 -1.685592 -1.690051
H  -0.313904 0.929879 -0.131187
H  -1.508794 -2.475711 -1.832725
H  0.207439 -2.146908 -1.801223
O  -0.062256 -2.110304 4.113861
H  0.758969 -2.362796 4.570297
H  -2.245261 -3.887858 2.443089
S  -0.904659 -0.457545 -3.00776
H  -2.240633 -0.37989 -3.018084
C  1.403647 -0.032614 0.01656
O  2.033212 1.000917 0.017469
C  2.130498 -1.361204 0.162424
H  1.550031 -2.198223 -0.214711
H  3.051881 -1.277624 -0.413841
C  2.454932 -1.526765 1.650846
H  1.559457 -1.377222 2.260304
H  3.163084 -0.747403 1.93804
C  3.068053 -2.88093 2.019693
H  3.899525 -3.128593 1.361538
N  2.046705 -3.978216 1.940527
H  1.610071 -4.141828 2.865395
H  1.249621 -3.733238 1.318009
C  3.531775 -2.792127 3.467506
O  2.788373 -3.00349 4.394105
O  4.789534 -2.399235 3.563331
H  5.022443 -2.279828 4.496388
H  2.452169 -4.858194 1.629124
totalener: -1406.23137105 hartree
nucrepener: 1913.52999183 hartree
electener: -3319.76136287 hartree
oneelecener: -5709.86379729 hartree
twoeener: 2390.10243442 hartree
kineticenergy: 1400.65214719 hartree
exchangeener: -105.326415899190 hartree
correlationener: -7.057338490042 hartree
xcener: -112.383754389232 hartree
temp: 298.15 k
press: 1.00 atm
thermalcorrenthalpy: 0.00094421 hartree
totalenthalpy: -1405.98477127 hartree
totalentropycorr: -0.06496910 hartree
gibbsenthalpy: -1406.04974037 hartree
gibbsminuselec: 0.26468226 hartree
chargesum: 1.0000000
charge: -0.159588 0.197912 -0.067407 0.144776 0.286242 -0.326647 0.273171 0.029010 -0.468518 -0.199224 0.115502 -0.170468 0.193974 0.130398 0.116230 -0.264232 0.260311 0.148828 -0.116155 0.103683 0.204163 -0.304074 -0.165297 0.070960 0.147740 -0.299099 0.125735 0.176043 0.026598 0.157459 -0.065346 0.230085 0.233115 0.318509 -0.347516 -0.223961 0.257446 0.229643
charge: 0.352523 -0.008808 -0.020939 0.042501 -0.442587 0.124162 -0.345730 -0.159790 0.100964 0.316349 0.038040 -0.245639 -0.010286 0.012993 0.005899 0.381333 -0.091816 0.042736 0.501398 -0.147841 -0.380350 0.118509 -0.007191 0.002543 0.040365 -0.002530 0.030315 0.050756 -0.046015 0.045002 0.612748 0.016103 -0.018423 -0.435846 0.126899 0.414586 -0.059285 0.046353
qa: -0.1596 0.1979 -0.0674 0.1448 0.2862 -0.3266 0.2732 0.0290 -0.4685 -0.1992 0.1155 -0.1705 0.1940 0.1304 0.1162 -0.2642 0.2603 0.1488 -0.1162 0.1037 0.2042 -0.3041 -0.1653 0.0710 0.1477 -0.2991 0.1257 0.1760 0.0266 0.1575 -0.0653 0.2301 0.2331 0.3185 -0.3475 -0.2240 0.2574 0.2296
va: 3.2709 1.0027 3.8211 0.9964 4.2411 2.1597 4.1385 3.8734 2.0219 3.0217 1.0079 4.0092 1.0190 1.0097 1.0008 2.2328 1.0160 1.0163 2.1705 1.0234 4.3277 2.2234 3.7799 1.0522 1.0291 3.8434 1.0320 1.0216 3.8449 1.0085 3.6063 1.0490 1.0579 4.2834 2.1205 2.3114 1.0030 0.9760
dispcorr: -0.082956648 hartree
energy: -1406.320834679307
dipole: -1.39930 1.37491 -0.02439 -3.36714 1.54535 -1.82180 -1.86358 3.18314 1.31956
magnitude: 2.24962 au
magnitude: 5.71807 debye
zeropoint: 0.31144496 hartree
thermalvibcorrection: 0.01840191 hartree
thermalrotcorrection: 0.00141627 hartree
thermaltrasncorrection: 0.00141627 hartree
thermaltotal: -1405.98815527 hartree
thermalcorr: 0.02123445 hartree
nonthermalcorr: 0.31144496 hartree
totalcorr: 0.33267941 hartree
totalenthalpy: -1405.98721106 hartree
