program: Orca
programVersion: 5.0.2
elementType: N H C H C O C C O N H C H H H O H H S H C O C H H C H H C H N H H C O O H H
charge: 1
multiplicity: 1
keywords: wB97X-D3BJ Opt Freq def2-TZVPP def2/J RIJCOSX VeryTightSCF
keywords: PAL8 defgrid3 TightOpt
frequency: 0.00 0.00 0.00 0.00 0.00 0.00 15.83 20.35 26.45 44.16 48.13 56.25 74.26 82.21 96.56 117.24 127.41 141.83 148.96 174.67 188.21 238.66 240.55 248.74 284.96 290.30 317.61 334.52 344.13 393.86 438.14 450.94 486.10 507.14 526.29 528.54 538.07 582.00 627.13 643.14 649.69 660.32 672.19 673.97 718.08 758.14 774.54 799.73 811.12 853.82 875.15 911.53 929.54 955.83 963.91 1001.57 1010.19 1025.91 1067.07 1092.34 1104.15 1119.90 1144.79 1156.51 1193.09 1202.47 1207.78 1215.88 1244.27 1252.16 1277.47 1283.71 1306.04 1322.76 1342.54 1350.69 1362.06 1366.35 1380.55 1394.46 1417.55 1428.90 1467.06 1483.59 1494.15 1506.90 1509.08 1516.33 1599.02 1619.28 1670.18 1696.74 1710.38 1828.54 1853.07 1898.43 2503.35 2767.39 3073.78 3090.57 3097.56 3098.33 3117.58 3122.18 3141.09 3152.92 3153.62 3173.62 3495.47 3548.79 3593.08 3631.63 3783.62 3796.40
frequency: 15.83 20.35 26.45 44.16 48.13 56.25 74.26 82.21 96.56 117.24 127.41 141.83 148.96 174.67 188.21 238.66 240.55 248.74 284.96 290.30 317.61 334.52 344.13 393.86 438.14 450.94 486.10 507.14 526.29 528.54 538.07 582.00 627.13 643.14 649.69 660.32 672.19 673.97 718.08 758.14 774.54 799.73 811.12 853.82 875.15 911.53 929.54 955.83 963.91 1001.57 1010.19 1025.91 1067.07 1092.34 1104.15 1119.90 1144.79 1156.51 1193.09 1202.47 1207.78 1215.88 1244.27 1252.16 1277.47 1283.71 1306.04 1322.76 1342.54 1350.69 1362.06 1366.35 1380.55 1394.46 1417.55 1428.90 1467.06 1483.59 1494.15 1506.90 1509.08 1516.33 1599.02 1619.28 1670.18 1696.74 1710.38 1828.54 1853.07 1898.43 2503.35 2767.39 3073.78 3090.57 3097.56 3098.33 3117.58 3122.18 3141.09 3152.92 3153.62 3173.62 3495.47 3548.79 3593.08 3631.63 3783.62 3796.40
formula: C10H18N3O6S
InChI: InChI=1S/C10H18N3O6S/c11-5(10(18)19)1-2-7(14)13-6(4-20)9(17)12-3-8(15)16/h5-6,12-13,15,18,20H,1-4H2,11H3
38 atoms
N  -1.245695 -1.444592 -2.231415
H  -1.496878 -0.465364 -2.276037
C  -1.338459 -2.166235 -3.482608
H  -0.361989 -2.526535 -3.813203
C  -1.900742 -1.212703 -4.517221
O  -2.19028 -0.070395 -4.275232
C  -0.90202 -2.010069 -1.089062
C  -0.926922 -1.125959 0.166275
O  -0.571371 -3.207386 -1.013794
N  -0.04383 0.015427 0.07072
H  -0.626839 -1.781939 0.98643
C  -2.349667 -0.655744 0.470203
H  -0.433703 0.933018 0.22681
H  -2.336411 -0.090967 1.402039
H  -2.716534 -0.011056 -0.330036
O  -2.024694 -1.800095 -5.704496
H  -2.384238 -1.156361 -6.330885
H  -1.994897 -3.032986 -3.386018
S  -3.40532 -2.120049 0.636997
H  -4.522089 -1.46401 0.967608
C  1.334983 -0.019758 0.135949
O  1.978471 0.99273 0.268545
C  1.995806 -1.386753 0.023724
H  1.486044 -1.994882 -0.722388
H  3.005769 -1.206028 -0.341344
C  2.072141 -2.118109 1.376376
H  1.212465 -1.895863 2.016118
H  2.949693 -1.775959 1.923132
C  2.191753 -3.634727 1.214004
H  2.836181 -3.864569 0.362644
N  0.856744 -4.260411 0.929924
H  0.298578 -3.773376 0.145764
H  0.963589 -5.241518 0.676308
C  2.842553 -4.278139 2.43827
O  3.884956 -3.907786 2.881027
O  2.108424 -5.295635 2.928008
H  2.573772 -5.672023 3.689213
H  0.281078 -4.251037 1.771403
totalener: -1406.22899595 hartree
nucrepener: 1812.35192215 hartree
electener: -3218.58091810 hartree
oneelecener: -5507.73000163 hartree
twoeener: 2289.14908354 hartree
kineticenergy: 1400.63001768 hartree
exchangeener: -105.316206567360 hartree
correlationener: -7.050174954653 hartree
xcener: -112.366381522012 hartree
temp: 298.15 k
press: 1.00 atm
thermalcorrenthalpy: 0.00094421 hartree
totalenthalpy: -1405.97932963 hartree
totalentropycorr: -0.06681933 hartree
gibbsenthalpy: -1406.04614895 hartree
gibbsminuselec: 0.26126628 hartree
chargesum: 1.0000000
charge: -0.115607 0.192667 -0.071678 0.131495 0.304108 -0.316893 0.248965 -0.002894 -0.418287 -0.199520 0.080161 -0.194406 0.192699 0.144358 0.133148 -0.250726 0.248468 0.139626 -0.141904 0.131921 0.168222 -0.285899 -0.141019 0.088434 0.157083 -0.267000 0.111016 0.173254 0.008385 0.154536 -0.070599 0.216691 0.230209 0.279230 -0.237938 -0.292265 0.256676 0.215281
charge: 0.370856 -0.010764 -0.019221 0.038035 -0.434167 0.121439 -0.374224 -0.169201 0.124983 0.317046 0.020242 -0.224345 -0.012271 0.010444 0.005585 0.387682 -0.072052 0.042248 0.491334 -0.136603 -0.377755 0.126157 -0.001920 0.017512 0.044983 0.003453 0.025946 0.050035 -0.051986 0.052573 0.589562 -0.068399 0.045586 -0.434943 0.175345 0.352848 -0.066237 0.040191
qa: -0.1156 0.1927 -0.0717 0.1315 0.3041 -0.3169 0.2490 -0.0029 -0.4183 -0.1995 0.0802 -0.1944 0.1927 0.1444 0.1331 -0.2507 0.2485 0.1396 -0.1419 0.1319 0.1682 -0.2859 -0.1410 0.0884 0.1571 -0.2670 0.1110 0.1733 0.0084 0.1545 -0.0706 0.2167 0.2302 0.2792 -0.2379 -0.2923 0.2567 0.2153
va: 3.2664 1.0421 3.8501 1.0057 4.3332 2.1731 4.1072 3.8703 2.0808 3.0345 1.0267 4.0967 1.0181 0.9999 1.0024 2.2490 1.0096 1.0064 2.1732 1.0170 4.3756 2.2336 3.6925 1.0462 1.0206 3.9015 1.0006 1.0182 3.7493 0.9984 3.5676 1.1220 0.9809 4.3792 2.2629 2.1974 1.0068 0.9968
dispcorr: -0.078839009 hartree
energy: -1406.313061389841
dipole: 0.56621 -1.11198 -0.54577 -2.71462 0.03099 -2.68362 3.53427 -2.82207 0.71220
magnitude: 2.82965 au
magnitude: 7.19240 debye
zeropoint: 0.30950223 hartree
thermalvibcorrection: 0.01899576 hartree
thermalrotcorrection: 0.00141627 hartree
thermaltrasncorrection: 0.00141627 hartree
thermaltotal: -1405.98173085 hartree
thermalcorr: 0.02182831 hartree
nonthermalcorr: 0.30950223 hartree
totalcorr: 0.33133054 hartree
totalenthalpy: -1405.98078665 hartree
