program: Orca
programVersion: 5.0.2
elementType: N H C H C O C C O N H C H H H O H H S H C O C H H C H H C H N H H C O O H H
charge: 1
multiplicity: 1
keywords: wB97X-D3BJ Opt Freq def2-TZVPP def2/J RIJCOSX VeryTightSCF
keywords: PAL8 defgrid3 TightOpt
frequency: 0.00 0.00 0.00 0.00 0.00 0.00 12.16 30.67 39.86 45.41 54.13 62.59 74.25 94.00 102.10 139.34 140.69 167.41 196.36 217.38 249.51 258.76 276.69 279.19 310.89 313.74 335.62 356.83 363.91 370.81 379.47 442.78 486.31 508.13 538.59 550.77 578.19 587.51 614.06 638.02 653.92 660.10 697.03 705.15 735.18 737.96 748.95 784.84 814.63 848.36 870.17 874.36 900.52 925.89 946.53 1017.26 1020.73 1042.36 1070.98 1075.58 1116.66 1124.16 1149.11 1169.47 1178.85 1194.50 1214.49 1219.88 1252.50 1287.70 1293.38 1295.85 1310.24 1319.56 1352.27 1359.46 1370.10 1382.89 1397.98 1413.29 1428.24 1454.27 1464.88 1473.21 1476.73 1483.43 1492.78 1510.20 1517.53 1607.92 1619.51 1676.66 1728.79 1757.26 1851.36 1879.78 2754.54 3090.63 3103.21 3113.17 3115.44 3120.78 3123.42 3160.18 3174.97 3179.82 3194.73 3291.95 3349.76 3437.67 3594.11 3624.36 3785.63 3802.01
frequency: 12.16 30.67 39.86 45.41 54.13 62.59 74.25 94.00 102.10 139.34 140.69 167.41 196.36 217.38 249.51 258.76 276.69 279.19 310.89 313.74 335.62 356.83 363.91 370.81 379.47 442.78 486.31 508.13 538.59 550.77 578.19 587.51 614.06 638.02 653.92 660.10 697.03 705.15 735.18 737.96 748.95 784.84 814.63 848.36 870.17 874.36 900.52 925.89 946.53 1017.26 1020.73 1042.36 1070.98 1075.58 1116.66 1124.16 1149.11 1169.47 1178.85 1194.50 1214.49 1219.88 1252.50 1287.70 1293.38 1295.85 1310.24 1319.56 1352.27 1359.46 1370.10 1382.89 1397.98 1413.29 1428.24 1454.27 1464.88 1473.21 1476.73 1483.43 1492.78 1510.20 1517.53 1607.92 1619.51 1676.66 1728.79 1757.26 1851.36 1879.78 2754.54 3090.63 3103.21 3113.17 3115.44 3120.78 3123.42 3160.18 3174.97 3179.82 3194.73 3291.95 3349.76 3437.67 3594.11 3624.36 3785.63 3802.01
formula: C10H18N3O6S
InChI: InChI=1S/C10H18N3O6S/c11-5(10(18)19)1-2-7(14)13-6(4-20)9(17)12-3-8(15)16/h5-6,12-13,15,18,20H,1-4H2,11H3
38 atoms
N  -1.253369 -2.17145 2.71878
H  -2.066283 -2.550854 2.255252
C  -0.835177 -2.700905 4.000242
H  -0.57528 -1.899418 4.688585
C  0.372558 -3.621002 3.896736
O  1.210548 -3.732926 4.742867
C  -0.402789 -1.43145 2.003454
C  -0.832159 -1.078823 0.566553
O  0.671717 -1.054463 2.474685
N  -0.000411 -0.009737 0.040865
H  -1.840756 -0.666105 0.629897
C  -0.918914 -2.288287 -0.388598
H  -0.39854 0.916334 0.097384
H  -1.109896 -1.88847 -1.384009
H  0.011102 -2.846687 -0.437338
O  0.378806 -4.334027 2.745671
H  1.120222 -4.951663 2.80354
H  -1.659376 -3.271364 4.429965
S  -2.266814 -3.446916 -0.03817
H  -1.550953 -4.323129 0.676177
C  1.359068 0.040533 0.018655
O  1.929336 1.126994 0.037314
C  2.16567 -1.242208 -0.11012
H  1.699101 -2.06451 0.426174
H  2.161059 -1.500777 -1.172903
C  3.613283 -1.070296 0.34932
H  4.062171 -0.208215 -0.147587
H  4.187009 -1.949308 0.057436
C  3.76137 -0.925322 1.864453
H  3.311024 -1.781532 2.372108
N  3.077084 0.299138 2.387044
H  3.659805 0.706662 3.125443
H  2.938145 0.975653 1.620431
C  5.211375 -0.82446 2.327289
O  5.595838 0.054451 3.05322
O  5.954178 -1.818582 1.859077
H  6.855338 -1.724931 2.200782
H  2.13774 0.0427 2.718151
totalener: -1406.24760158 hartree
nucrepener: 1898.80171567 hartree
electener: -3305.04931725 hartree
oneelecener: -5680.64586935 hartree
twoeener: 2375.59655210 hartree
kineticenergy: 1400.67104365 hartree
exchangeener: -105.327082133233 hartree
correlationener: -7.056738054702 hartree
xcener: -112.383820187935 hartree
temp: 298.15 k
press: 1.00 atm
thermalcorrenthalpy: 0.00094421 hartree
totalenthalpy: -1406.00000559 hartree
totalentropycorr: -0.06511900 hartree
gibbsenthalpy: -1406.06512459 hartree
gibbsminuselec: 0.26498202 hartree
chargesum: 1.0000000
charge: -0.185208 0.187116 -0.064985 0.136323 0.287953 -0.276424 0.303143 0.029123 -0.492054 -0.177522 0.146994 -0.172706 0.185167 0.153184 0.118584 -0.292945 0.234558 0.134405 -0.130988 0.117792 0.193893 -0.373567 -0.147537 0.074706 0.147745 -0.227654 0.141408 0.132657 0.039895 0.122886 -0.049056 0.225439 0.230994 0.296121 -0.299401 -0.247114 0.254485 0.242588
charge: 0.347262 -0.045882 -0.028312 0.041462 -0.438886 0.138183 -0.357904 -0.137013 0.078581 0.336569 0.044982 -0.235267 -0.005115 0.018927 0.001175 0.341053 -0.087041 0.042529 0.525681 -0.147295 -0.366533 0.084632 -0.009233 0.020982 0.045632 0.002877 0.038133 0.040534 -0.046556 0.046345 0.617417 0.029402 0.016343 -0.429313 0.139174 0.399988 -0.063632 0.000118
qa: -0.1852 0.1871 -0.0650 0.1363 0.2880 -0.2764 0.3031 0.0291 -0.4921 -0.1775 0.1470 -0.1727 0.1852 0.1532 0.1186 -0.2929 0.2346 0.1344 -0.1310 0.1178 0.1939 -0.3736 -0.1475 0.0747 0.1477 -0.2277 0.1414 0.1327 0.0399 0.1229 -0.0491 0.2254 0.2310 0.2961 -0.2994 -0.2471 0.2545 0.2426
va: 3.2419 1.0591 3.8201 1.0218 4.2578 2.2310 4.1056 3.8774 1.9830 3.1539 0.9974 3.9438 1.0186 1.0047 1.0085 2.1476 1.0204 0.9992 2.1978 1.0254 4.2919 2.1057 3.7867 1.0277 1.0006 3.9281 1.0112 1.0196 3.8536 1.0268 3.5871 1.0090 1.0318 4.3482 2.1928 2.2624 1.0056 1.0192
dispcorr: -0.082127293 hartree
energy: -1406.335890245494
dipole: 0.38038 -0.06036 0.32002 0.48512 -0.53821 -0.05309 -4.34361 4.04519 -0.29842
magnitude: 0.44078 au
magnitude: 1.12038 debye
zeropoint: 0.31162565 hartree
thermalvibcorrection: 0.01834020 hartree
thermalrotcorrection: 0.00141627 hartree
thermaltrasncorrection: 0.00141627 hartree
thermaltotal: -1406.00309185 hartree
thermalcorr: 0.02117275 hartree
nonthermalcorr: 0.31162565 hartree
totalcorr: 0.33279840 hartree
totalenthalpy: -1406.00214764 hartree
