program: Orca
programVersion: 5.0.2
elementType: N H C H C O C C O N H C H H H O H H S H C O C H H C H H C H N H H C O O H H
charge: 1
multiplicity: 1
keywords: wB97X-D3BJ Opt Freq def2-TZVPP def2/J RIJCOSX VeryTightSCF
keywords: PAL8 defgrid3 TightOpt
frequency: 0.00 0.00 0.00 0.00 0.00 0.00 28.29 38.45 43.00 54.26 61.82 72.48 90.17 103.97 122.71 131.25 169.35 173.75 195.16 204.46 220.03 254.05 261.33 293.82 297.57 315.10 334.26 353.73 370.24 378.14 386.27 442.98 505.84 514.43 519.71 534.90 577.33 586.53 602.01 652.51 656.57 660.38 684.74 697.31 707.91 741.22 767.06 789.18 847.44 850.19 865.55 890.76 909.83 933.96 947.51 976.30 1014.02 1047.29 1071.62 1085.08 1124.94 1132.14 1150.01 1166.09 1178.09 1194.04 1213.89 1218.44 1252.41 1286.63 1298.62 1305.87 1316.37 1331.79 1337.70 1358.46 1364.07 1389.30 1413.33 1429.85 1450.27 1458.74 1462.31 1467.44 1481.76 1493.07 1502.22 1514.11 1532.99 1623.04 1627.54 1679.65 1733.63 1763.46 1837.32 1847.63 2763.04 3086.20 3089.75 3104.16 3107.78 3115.02 3116.66 3156.56 3166.35 3166.90 3176.59 3236.04 3334.62 3449.49 3535.58 3637.54 3788.03 3805.79
frequency: 28.29 38.45 43.00 54.26 61.82 72.48 90.17 103.97 122.71 131.25 169.35 173.75 195.16 204.46 220.03 254.05 261.33 293.82 297.57 315.10 334.26 353.73 370.24 378.14 386.27 442.98 505.84 514.43 519.71 534.90 577.33 586.53 602.01 652.51 656.57 660.38 684.74 697.31 707.91 741.22 767.06 789.18 847.44 850.19 865.55 890.76 909.83 933.96 947.51 976.30 1014.02 1047.29 1071.62 1085.08 1124.94 1132.14 1150.01 1166.09 1178.09 1194.04 1213.89 1218.44 1252.41 1286.63 1298.62 1305.87 1316.37 1331.79 1337.70 1358.46 1364.07 1389.30 1413.33 1429.85 1450.27 1458.74 1462.31 1467.44 1481.76 1493.07 1502.22 1514.11 1532.99 1623.04 1627.54 1679.65 1733.63 1763.46 1837.32 1847.63 2763.04 3086.20 3089.75 3104.16 3107.78 3115.02 3116.66 3156.56 3166.35 3166.90 3176.59 3236.04 3334.62 3449.49 3535.58 3637.54 3788.03 3805.79
formula: C10H18N3O6S
InChI: InChI=1S/C10H18N3O6S/c11-5(10(18)19)1-2-7(14)13-6(4-20)9(17)12-3-8(15)16/h5-6,12-13,15,18,20H,1-4H2,11H3
38 atoms
N  -0.876804 -2.662968 2.415191
H  -1.517359 -3.193441 1.838031
C  -0.460559 -3.190644 3.689696
H  -0.522978 -2.425744 4.466247
C  0.971065 -3.700248 3.659533
O  1.729591 -3.597502 2.728281
C  -0.369962 -1.521457 1.94009
C  -0.831736 -1.097916 0.525156
O  0.404978 -0.827034 2.595481
N  -0.002441 -0.018254 0.028621
H  -1.825414 -0.660228 0.660494
C  -0.969187 -2.254552 -0.484416
H  -0.397521 0.908995 0.067424
H  -0.91902 -1.83005 -1.484828
H  -0.169113 -2.983043 -0.367408
O  1.286578 -4.270701 4.823043
H  2.194284 -4.599442 4.773995
H  -1.12054 -4.007635 3.979034
S  -2.574517 -3.077467 -0.255991
H  -2.286492 -4.192903 -0.935223
C  1.35439 -0.000636 -0.00609
O  1.95818 1.065455 -0.043879
C  2.109242 -1.32096 -0.040507
H  1.613712 -2.098032 0.540022
H  2.104418 -1.648204 -1.084069
C  3.555395 -1.1702 0.428394
H  4.033814 -0.341321 -0.096203
H  4.107599 -2.077399 0.186999
C  3.669607 -0.971103 1.939236
H  3.222914 -1.826562 2.452039
N  2.943531 0.252664 2.405737
H  3.454189 0.650409 3.199344
H  2.891166 0.940774 1.641615
C  5.101449 -0.823328 2.436801
O  5.434189 0.050936 3.194724
O  5.898597 -1.773727 1.965357
H  6.785882 -1.645304 2.33066
H  1.96724 0.009803 2.647682
totalener: -1406.25677368 hartree
nucrepener: 1894.40016865 hartree
electener: -3300.65694233 hartree
oneelecener: -5672.38739426 hartree
twoeener: 2371.73045193 hartree
kineticenergy: 1400.68480245 hartree
exchangeener: -105.334422104207 hartree
correlationener: -7.058475143760 hartree
xcener: -112.392897247967 hartree
temp: 298.15 k
press: 1.00 atm
thermalcorrenthalpy: 0.00094421 hartree
totalenthalpy: -1406.00952154 hartree
totalentropycorr: -0.06509189 hartree
gibbsenthalpy: -1406.07461343 hartree
gibbsminuselec: 0.26474293 hartree
chargesum: 1.0000000
charge: -0.159452 0.177597 -0.086025 0.138620 0.321597 -0.354259 0.295701 0.033568 -0.467095 -0.162193 0.134292 -0.188333 0.189025 0.139554 0.131356 -0.243869 0.240297 0.149818 -0.134345 0.127250 0.161708 -0.370743 -0.156194 0.094320 0.144401 -0.212097 0.138755 0.130844 0.042329 0.118865 -0.051789 0.222054 0.229892 0.286929 -0.305181 -0.246398 0.251377 0.237826
charge: 0.350597 -0.061169 -0.033763 0.043977 -0.432151 0.097296 -0.361723 -0.137050 0.089660 0.340035 0.044993 -0.224925 -0.005121 0.010209 0.001505 0.387377 -0.079133 0.043351 0.522841 -0.138239 -0.371991 0.082497 -0.004519 0.025996 0.044720 0.004878 0.036845 0.041838 -0.048414 0.041555 0.615353 0.029355 0.021969 -0.430384 0.132587 0.399932 -0.065980 -0.014803
qa: -0.1595 0.1776 -0.0860 0.1386 0.3216 -0.3543 0.2957 0.0336 -0.4671 -0.1622 0.1343 -0.1883 0.1890 0.1396 0.1314 -0.2439 0.2403 0.1498 -0.1343 0.1273 0.1617 -0.3707 -0.1562 0.0943 0.1444 -0.2121 0.1388 0.1308 0.0423 0.1189 -0.0518 0.2221 0.2299 0.2869 -0.3052 -0.2464 0.2514 0.2378
va: 3.1982 1.0771 3.8084 1.0136 4.2530 2.1096 4.1166 3.8779 2.0310 3.1437 0.9936 3.9710 1.0169 1.0073 0.9972 2.2507 1.0171 1.0071 2.2056 1.0167 4.3167 2.1113 3.7648 1.0293 1.0019 3.9380 1.0123 1.0196 3.8150 1.0623 3.5732 1.0090 1.0277 4.3643 2.1884 2.2604 1.0080 1.0437
dispcorr: -0.083012066 hartree
energy: -1406.344848805974
dipole: 0.08279 0.22803 0.31082 -1.30507 0.45507 -0.85000 -3.86477 4.22004 0.35527
magnitude: 0.97228 au
magnitude: 2.47134 debye
zeropoint: 0.31166952 hartree
thermalvibcorrection: 0.01816244 hartree
thermalrotcorrection: 0.00141627 hartree
thermaltrasncorrection: 0.00141627 hartree
thermaltotal: -1406.01218430 hartree
thermalcorr: 0.02099498 hartree
nonthermalcorr: 0.31166952 hartree
totalcorr: 0.33266450 hartree
totalenthalpy: -1406.01124010 hartree
