program: Orca
programVersion: 5.0.2
elementType: N H C H C O C C O N H C H H H O H H S H C O C H H C H H C H N H H C O O H H
charge: 1
multiplicity: 1
keywords: wB97X-D3BJ Opt Freq def2-TZVPP def2/J RIJCOSX VeryTightSCF
keywords: PAL8 defgrid3 TightOpt
frequency: 0.00 0.00 0.00 0.00 0.00 0.00 13.03 35.03 36.79 42.10 60.57 67.51 92.37 105.82 117.50 124.44 151.17 167.08 182.11 201.22 214.78 238.12 248.94 266.67 292.98 302.33 319.12 334.88 381.08 387.17 437.80 485.54 506.26 519.33 531.90 543.25 549.61 568.95 593.03 601.08 645.30 670.00 705.54 712.04 762.83 775.12 782.42 818.40 829.19 864.62 888.15 894.83 912.85 941.00 977.92 1004.01 1013.90 1016.20 1043.64 1107.67 1109.47 1142.81 1145.20 1168.85 1173.64 1198.18 1241.51 1256.42 1268.09 1274.76 1286.88 1297.75 1308.32 1328.17 1351.43 1368.93 1376.76 1380.82 1386.18 1403.62 1413.16 1459.06 1478.29 1479.49 1486.28 1493.57 1510.85 1514.67 1543.66 1585.18 1596.60 1681.03 1722.87 1736.06 1830.39 1893.01 2753.01 2943.89 3086.79 3090.10 3094.49 3103.74 3113.91 3125.07 3144.02 3150.75 3152.32 3171.30 3210.04 3419.10 3571.25 3607.04 3675.69 3800.73
frequency: 13.03 35.03 36.79 42.10 60.57 67.51 92.37 105.82 117.50 124.44 151.17 167.08 182.11 201.22 214.78 238.12 248.94 266.67 292.98 302.33 319.12 334.88 381.08 387.17 437.80 485.54 506.26 519.33 531.90 543.25 549.61 568.95 593.03 601.08 645.30 670.00 705.54 712.04 762.83 775.12 782.42 818.40 829.19 864.62 888.15 894.83 912.85 941.00 977.92 1004.01 1013.90 1016.20 1043.64 1107.67 1109.47 1142.81 1145.20 1168.85 1173.64 1198.18 1241.51 1256.42 1268.09 1274.76 1286.88 1297.75 1308.32 1328.17 1351.43 1368.93 1376.76 1380.82 1386.18 1403.62 1413.16 1459.06 1478.29 1479.49 1486.28 1493.57 1510.85 1514.67 1543.66 1585.18 1596.60 1681.03 1722.87 1736.06 1830.39 1893.01 2753.01 2943.89 3086.79 3090.10 3094.49 3103.74 3113.91 3125.07 3144.02 3150.75 3152.32 3171.30 3210.04 3419.10 3571.25 3607.04 3675.69 3800.73
formula: C10H18N3O6S
InChI: InChI=1S/C10H18N3O6S/c11-5(10(18)19)1-2-7(14)13-6(4-20)9(17)12-3-8(15)16/h5-6,12-13,15,18,20H,1-4H2,11H3
38 atoms
N  -3.133646 -0.427858 -0.87751
H  -3.445331 -0.268905 0.065539
C  -4.095334 -0.215952 -1.947672
H  -3.71232 0.507322 -2.669269
C  -5.432164 0.288089 -1.4448
O  -6.345849 0.548682 -2.167557
C  -1.900021 -0.864543 -1.135236
C  -0.94142 -1.052908 0.057006
O  -1.523313 -1.097884 -2.283591
N  0.023728 0.033286 0.034279
H  -0.421734 -1.983119 -0.156089
C  -1.601933 -1.172651 1.432569
H  -0.341726 0.974398 0.091908
H  -2.028813 -0.214856 1.739998
H  -2.406862 -1.906954 1.414293
O  -5.477184 0.4047 -0.098396
H  -6.358852 0.72332 0.138511
H  -4.273016 -1.144183 -2.494269
S  -0.411246 -1.610189 2.722154
H  -0.417353 -2.928809 2.494123
C  1.36762 -0.005259 -0.010177
O  2.002269 1.056881 -0.014289
C  2.102284 -1.323751 -0.095493
H  2.480019 -1.530624 0.90802
H  1.442372 -2.140777 -0.362188
C  3.282037 -1.277019 -1.085268
H  3.523099 -2.30206 -1.363552
H  4.171159 -0.878319 -0.591781
C  3.063399 -0.475615 -2.380013
H  3.674396 -0.888966 -3.18411
N  3.467491 0.956761 -2.190505
H  3.088438 1.23679 -1.249384
H  4.472882 1.093994 -2.240803
C  1.611078 -0.404138 -2.873565
O  1.148314 0.639066 -3.266746
O  0.988939 -1.552991 -2.772684
H  -0.004465 -1.408597 -2.781936
H  2.980075 1.520431 -2.895307
totalener: -1406.24162950 hartree
nucrepener: 1858.79276206 hartree
electener: -3265.03439156 hartree
oneelecener: -5601.38375707 hartree
twoeener: 2336.34936551 hartree
kineticenergy: 1400.64113580 hartree
exchangeener: -105.327083693557 hartree
correlationener: -7.057501300514 hartree
xcener: -112.384584994070 hartree
temp: 298.15 k
press: 1.00 atm
thermalcorrenthalpy: 0.00094421 hartree
totalenthalpy: -1405.99432217 hartree
totalentropycorr: -0.06531028 hartree
gibbsenthalpy: -1406.05963244 hartree
gibbsminuselec: 0.26262489 hartree
chargesum: 1.0000000
charge: -0.149514 0.184235 -0.070394 0.139840 0.290691 -0.264623 0.275567 -0.036535 -0.403178 -0.116959 0.120127 -0.192638 0.187540 0.119681 0.145073 -0.295624 0.240981 0.138200 -0.118385 0.107519 0.231348 -0.404292 -0.142742 0.138661 0.123290 -0.232731 0.130782 0.122013 0.000669 0.160300 -0.062303 0.234284 0.220191 0.291498 -0.308056 -0.299644 0.269180 0.225950
charge: 0.349172 -0.029379 -0.016703 0.045051 -0.429916 0.152071 -0.352632 -0.141314 0.147231 0.361019 0.035061 -0.252060 0.002225 0.009564 0.011810 0.343748 -0.077913 0.044805 0.512733 -0.145706 -0.357255 0.107098 -0.006936 0.044064 0.019104 0.008372 0.041948 0.032701 -0.043967 0.043092 0.606067 -0.028333 0.035924 -0.466902 0.128383 0.384681 -0.151597 0.034688
qa: -0.1495 0.1842 -0.0704 0.1398 0.2907 -0.2646 0.2756 -0.0365 -0.4032 -0.1170 0.1201 -0.1926 0.1875 0.1197 0.1451 -0.2956 0.2410 0.1382 -0.1184 0.1075 0.2313 -0.4043 -0.1427 0.1387 0.1233 -0.2327 0.1308 0.1220 0.0007 0.1603 -0.0623 0.2343 0.2202 0.2915 -0.3081 -0.2996 0.2692 0.2259
va: 3.2210 1.0319 3.8416 1.0082 4.3101 2.2459 4.2075 3.9046 2.1243 3.0936 1.0195 3.9690 1.0214 1.0052 1.0032 2.1440 1.0168 1.0054 2.1804 1.0225 4.2414 2.1067 3.7737 1.0184 1.0212 3.9496 1.0060 1.0052 3.8229 0.9918 3.6150 1.0660 0.9816 4.3872 2.1896 2.2253 1.0675 1.0101
dispcorr: -0.080977775 hartree
energy: -1406.328174387316
dipole: 12.25094 -8.91043 3.34051 -3.43077 3.32262 -0.10815 1.28793 -1.05897 0.22896
magnitude: 3.35010 au
magnitude: 8.51527 debye
zeropoint: 0.31026459 hartree
thermalvibcorrection: 0.01834895 hartree
thermalrotcorrection: 0.00141627 hartree
thermaltrasncorrection: 0.00141627 hartree
thermaltotal: -1405.99672830 hartree
thermalcorr: 0.02118149 hartree
nonthermalcorr: 0.31026459 hartree
totalcorr: 0.33144609 hartree
totalenthalpy: -1405.99578409 hartree
