program: Orca
programVersion: 5.0.2
elementType: N H C H C O C C O N H C H H H O H H S H C O C H H C H H C H N H H C O O H H
charge: 1
multiplicity: 1
keywords: wB97X-D3BJ Opt Freq def2-TZVPP def2/J RIJCOSX VeryTightSCF
keywords: PAL8 defgrid3 TightOpt
frequency: 0.00 0.00 0.00 0.00 0.00 0.00 28.80 43.94 53.71 66.14 77.01 88.96 99.49 111.59 119.37 130.28 138.20 166.48 186.01 211.88 216.26 257.15 260.81 267.45 293.96 321.68 341.38 360.21 366.21 385.27 421.78 444.00 485.17 502.10 513.81 541.71 589.64 592.13 610.40 616.86 628.39 650.44 662.43 748.88 759.20 788.25 796.55 824.79 829.33 850.21 856.68 884.42 912.80 941.65 948.88 1001.43 1023.71 1043.59 1078.12 1101.72 1110.58 1124.20 1138.00 1153.32 1168.07 1214.12 1225.21 1249.72 1259.05 1268.91 1296.87 1299.86 1333.91 1339.28 1349.16 1366.08 1374.00 1384.16 1392.38 1405.58 1449.86 1458.06 1460.25 1487.18 1491.66 1493.14 1501.70 1507.47 1549.75 1589.85 1672.31 1688.80 1730.09 1799.44 1810.81 1847.80 2746.86 2989.18 3093.75 3095.16 3101.16 3102.28 3110.23 3114.15 3150.27 3160.13 3167.97 3193.30 3338.31 3360.43 3524.95 3554.68 3652.47 3783.47
frequency: 28.80 43.94 53.71 66.14 77.01 88.96 99.49 111.59 119.37 130.28 138.20 166.48 186.01 211.88 216.26 257.15 260.81 267.45 293.96 321.68 341.38 360.21 366.21 385.27 421.78 444.00 485.17 502.10 513.81 541.71 589.64 592.13 610.40 616.86 628.39 650.44 662.43 748.88 759.20 788.25 796.55 824.79 829.33 850.21 856.68 884.42 912.80 941.65 948.88 1001.43 1023.71 1043.59 1078.12 1101.72 1110.58 1124.20 1138.00 1153.32 1168.07 1214.12 1225.21 1249.72 1259.05 1268.91 1296.87 1299.86 1333.91 1339.28 1349.16 1366.08 1374.00 1384.16 1392.38 1405.58 1449.86 1458.06 1460.25 1487.18 1491.66 1493.14 1501.70 1507.47 1549.75 1589.85 1672.31 1688.80 1730.09 1799.44 1810.81 1847.80 2746.86 2989.18 3093.75 3095.16 3101.16 3102.28 3110.23 3114.15 3150.27 3160.13 3167.97 3193.30 3338.31 3360.43 3524.95 3554.68 3652.47 3783.47
formula: C10H18N3O6S
InChI: InChI=1S/C10H18N3O6S/c11-5(10(18)19)1-2-7(14)13-6(4-20)9(17)12-3-8(15)16/h5-6,12-13,15,18,20H,1-4H2,11H3
38 atoms
N  -0.498259 -3.477248 0.632546
H  -0.889673 -3.778105 -0.250225
C  -0.127027 -4.477419 1.62334
H  -0.766923 -4.410555 2.505688
C  1.334091 -4.250427 2.002342
O  2.255609 -4.836366 1.469348
C  -0.593909 -2.179555 0.975448
C  -0.904614 -1.145856 -0.121529
O  -0.380374 -1.794469 2.121922
N  0.019698 -0.029283 -0.020764
H  -1.88318 -0.748201 0.160928
C  -0.995027 -1.626374 -1.579064
H  -0.374662 0.89648 0.031386
H  -1.178637 -0.749252 -2.197317
H  -0.046691 -2.051486 -1.911184
O  1.575668 -3.307546 2.901971
H  0.769429 -2.74018 2.991041
H  -0.215814 -5.463915 1.176564
S  -2.235234 -2.893465 -1.946353
H  -3.28162 -2.282171 -1.376476
C  1.387354 -0.02845 0.014516
O  2.010536 1.011215 0.04002
C  2.111366 -1.370243 0.076171
H  1.914711 -1.776612 1.068891
H  1.702473 -2.079674 -0.645639
C  3.610622 -1.19268 -0.137387
H  3.997559 -0.43673 0.550529
H  3.806522 -0.815615 -1.140326
C  4.382517 -2.499737 0.032533
H  3.9757 -3.276731 -0.619106
N  4.315914 -3.027057 1.435526
H  4.040914 -2.300866 2.095815
H  3.630183 -3.813872 1.530102
C  5.871277 -2.363601 -0.281968
O  6.723217 -2.694118 0.502102
O  6.081406 -1.873289 -1.492786
H  7.034946 -1.818496 -1.653339
H  5.265995 -3.333614 1.686774
totalener: -1406.23353484 hartree
nucrepener: 1876.12123166 hartree
electener: -3282.35476650 hartree
oneelecener: -5634.76191495 hartree
twoeener: 2352.40714845 hartree
kineticenergy: 1400.62970874 hartree
exchangeener: -105.321343793982 hartree
correlationener: -7.059623147840 hartree
xcener: -112.380966941821 hartree
temp: 298.15 k
press: 1.00 atm
thermalcorrenthalpy: 0.00094421 hartree
totalenthalpy: -1405.98779805 hartree
totalentropycorr: -0.06472027 hartree
gibbsenthalpy: -1406.05251832 hartree
gibbsminuselec: 0.26337359 hartree
chargesum: 1.0000000
charge: -0.170982 0.188605 -0.116609 0.161718 0.337264 -0.341460 0.212681 0.005673 -0.381547 -0.187354 0.125321 -0.168163 0.190319 0.142557 0.124940 -0.278583 0.259954 0.140994 -0.127529 0.112833 0.226790 -0.319832 -0.154180 0.060743 0.110430 -0.235405 0.134057 0.131579 0.055586 0.140541 -0.079462 0.222577 0.233802 0.297800 -0.299462 -0.239970 0.257404 0.226372
charge: 0.335350 -0.064230 -0.022621 0.035660 -0.421463 0.142451 -0.367355 -0.136566 0.128304 0.338208 0.048225 -0.245259 -0.008005 0.014490 0.004673 0.369254 -0.137879 0.042620 0.525590 -0.141185 -0.371564 0.108378 -0.018569 0.018846 0.022044 -0.002272 0.039793 0.046301 -0.047456 0.047187 0.609511 0.044379 -0.025490 -0.429073 0.140825 0.407209 -0.060977 0.030668
qa: -0.1710 0.1886 -0.1166 0.1617 0.3373 -0.3415 0.2127 0.0057 -0.3815 -0.1874 0.1253 -0.1682 0.1903 0.1426 0.1249 -0.2786 0.2600 0.1410 -0.1275 0.1128 0.2268 -0.3198 -0.1542 0.0607 0.1104 -0.2354 0.1341 0.1316 0.0556 0.1405 -0.0795 0.2226 0.2338 0.2978 -0.2995 -0.2400 0.2574 0.2264
va: 3.1347 1.0669 3.8867 0.9980 4.1361 2.1769 4.2011 3.8953 2.1427 3.1511 0.9974 3.9608 1.0179 1.0062 0.9996 2.1975 1.0514 1.0112 2.2042 1.0220 4.3522 2.1985 3.6881 1.0629 1.0081 3.9130 1.0173 1.0271 3.7971 1.0119 3.5673 0.9896 1.0856 4.3475 2.1921 2.2755 1.0030 1.0165
dispcorr: -0.082829193 hartree
energy: -1406.322221453104
dipole: -1.08462 1.52869 0.44407 -0.34246 -0.86406 -1.20653 -1.06027 0.82913 -0.23114
magnitude: 1.30626 au
magnitude: 3.32026 debye
zeropoint: 0.31090303 hartree
thermalvibcorrection: 0.01804569 hartree
thermalrotcorrection: 0.00141627 hartree
thermaltrasncorrection: 0.00141627 hartree
thermaltotal: -1405.99044019 hartree
thermalcorr: 0.02087823 hartree
nonthermalcorr: 0.31090303 hartree
totalcorr: 0.33178127 hartree
totalenthalpy: -1405.98949598 hartree
