program: Orca
programVersion: 5.0.2
elementType: N H C H C O C C O N H C H H H O H H S H C O C H H C H H C H N H H C O O H H
charge: 1
multiplicity: 1
keywords: wB97X-D3BJ Opt Freq def2-TZVPP def2/J RIJCOSX VeryTightSCF
keywords: PAL8 defgrid3 TightOpt
frequency: 0.00 0.00 0.00 0.00 0.00 0.00 15.80 21.67 27.19 31.67 42.63 46.56 54.11 77.47 99.06 116.73 128.49 157.93 171.59 211.34 225.09 231.49 272.08 285.68 309.06 315.29 336.67 364.37 382.83 383.85 422.83 449.39 476.81 514.04 524.41 573.81 579.24 602.92 613.90 653.28 670.22 697.62 711.48 734.00 746.83 780.54 796.99 808.87 820.91 840.00 853.96 893.39 915.60 922.24 948.20 1011.29 1012.46 1046.14 1068.09 1074.43 1092.25 1118.52 1139.64 1170.03 1177.98 1205.91 1207.63 1236.47 1258.35 1283.70 1294.38 1306.29 1307.98 1320.47 1354.20 1357.90 1370.20 1375.09 1391.63 1403.81 1423.53 1428.64 1461.57 1472.67 1480.59 1486.98 1491.41 1505.66 1551.21 1603.81 1639.94 1673.22 1712.86 1754.93 1889.87 1891.87 2235.03 2750.33 3074.16 3082.27 3107.41 3110.27 3118.30 3121.74 3146.99 3152.38 3164.28 3197.34 3508.86 3539.25 3570.74 3637.66 3690.67 3783.10
frequency: 15.80 21.67 27.19 31.67 42.63 46.56 54.11 77.47 99.06 116.73 128.49 157.93 171.59 211.34 225.09 231.49 272.08 285.68 309.06 315.29 336.67 364.37 382.83 383.85 422.83 449.39 476.81 514.04 524.41 573.81 579.24 602.92 613.90 653.28 670.22 697.62 711.48 734.00 746.83 780.54 796.99 808.87 820.91 840.00 853.96 893.39 915.60 922.24 948.20 1011.29 1012.46 1046.14 1068.09 1074.43 1092.25 1118.52 1139.64 1170.03 1177.98 1205.91 1207.63 1236.47 1258.35 1283.70 1294.38 1306.29 1307.98 1320.47 1354.20 1357.90 1370.20 1375.09 1391.63 1403.81 1423.53 1428.64 1461.57 1472.67 1480.59 1486.98 1491.41 1505.66 1551.21 1603.81 1639.94 1673.22 1712.86 1754.93 1889.87 1891.87 2235.03 2750.33 3074.16 3082.27 3107.41 3110.27 3118.30 3121.74 3146.99 3152.38 3164.28 3197.34 3508.86 3539.25 3570.74 3637.66 3690.67 3783.10
formula: C10H18N3O6S
InChI: InChI=1S/C10H18N3O6S/c11-5(10(18)19)1-2-7(14)13-6(4-20)9(17)12-3-8(15)16/h5-6,12-13,15,18,20H,1-4H2,11H3
38 atoms
N  -3.14907 -1.304524 -0.941127
H  -2.944796 -2.289554 -0.87356
C  -4.526681 -0.909686 -1.221662
H  -4.518506 0.05843 -1.723536
C  -5.336382 -0.847278 0.078049
O  -6.183323 -1.644414 0.353764
C  -2.270573 -0.442713 -0.415691
C  -0.934289 -1.029935 0.049538
O  -2.497832 0.752583 -0.254124
N  0.014693 0.070965 0.002129
H  -0.629412 -1.831911 -0.623374
C  -1.077526 -1.576598 1.483599
H  -0.418901 0.98965 0.025114
H  -0.091158 -1.862547 1.84889
H  -1.453099 -0.792786 2.140873
O  -4.983807 0.137173 0.922397
H  -4.281699 0.685231 0.536903
H  -4.97941 -1.653057 -1.871508
S  -2.105685 -3.057248 1.620114
H  -3.275965 -2.441146 1.826641
C  1.342148 0.038821 -0.033848
O  1.977405 1.112428 -0.049954
C  2.05734 -1.297982 -0.030726
H  2.161832 -1.606723 1.014599
H  1.431764 -2.053864 -0.504876
C  3.429492 -1.315427 -0.716211
H  3.357514 -0.908048 -1.729297
H  3.73428 -2.356689 -0.819953
C  4.567721 -0.617333 0.035564
H  4.476794 -0.81592 1.106324
N  4.495164 0.862987 -0.137647
H  4.847415 1.139516 -1.052193
H  3.423513 1.108384 -0.069606
C  5.926067 -1.176531 -0.389073
O  6.151355 -2.346475 -0.449463
O  6.80936 -0.200519 -0.658083
H  7.655326 -0.606097 -0.898151
H  5.048851 1.358532 0.556786
totalener: -1406.23578197 hartree
nucrepener: 1737.55299499 hartree
electener: -3143.78877696 hartree
oneelecener: -5358.63586691 hartree
twoeener: 2214.84708995 hartree
kineticenergy: 1400.62338418 hartree
exchangeener: -105.317679021374 hartree
correlationener: -7.051963154752 hartree
xcener: -112.369642176126 hartree
temp: 298.15 k
press: 1.00 atm
thermalcorrenthalpy: 0.00094421 hartree
totalenthalpy: -1405.98516788 hartree
totalentropycorr: -0.06634325 hartree
gibbsenthalpy: -1406.05151113 hartree
gibbsminuselec: 0.26115407 hartree
chargesum: 1.0000000
charge: -0.188948 0.191762 -0.101838 0.144928 0.237054 -0.261424 0.265011 -0.002623 -0.427901 -0.133719 0.123206 -0.172090 0.209713 0.115276 0.145555 -0.239267 0.230780 0.137560 -0.139692 0.138119 0.284239 -0.396179 -0.184284 0.116103 0.134427 -0.226414 0.122394 0.154033 0.001534 0.136615 -0.074953 0.214132 0.219708 0.276049 -0.247027 -0.284821 0.257781 0.225200
charge: 0.341740 -0.025792 -0.027785 0.033441 -0.457611 0.144752 -0.382145 -0.132811 0.088682 0.374154 0.026901 -0.242131 0.002487 0.004757 0.017984 0.369118 -0.129517 0.037051 0.513312 -0.135858 -0.325372 0.166294 -0.003263 0.040375 0.037269 0.008281 0.036156 0.048038 -0.057294 0.048999 0.583117 0.035965 -0.101937 -0.435321 0.168399 0.359365 -0.065331 0.035532
qa: -0.1889 0.1918 -0.1018 0.1449 0.2371 -0.2614 0.2650 -0.0026 -0.4279 -0.1337 0.1232 -0.1721 0.2097 0.1153 0.1456 -0.2393 0.2308 0.1376 -0.1397 0.1381 0.2842 -0.3962 -0.1843 0.1161 0.1344 -0.2264 0.1224 0.1540 0.0015 0.1366 -0.0750 0.2141 0.2197 0.2760 -0.2470 -0.2848 0.2578 0.2252
va: 3.2344 1.0300 3.8121 1.0005 4.3527 2.2308 4.2477 3.8539 2.0683 3.2575 1.0129 3.9631 1.0307 1.0002 1.0069 2.1936 1.0430 1.0104 2.1887 1.0192 4.1744 2.1237 3.8065 1.0065 1.0067 3.9806 1.0053 1.0159 3.7981 1.0037 3.5314 0.9970 1.1169 4.3875 2.2521 2.2088 1.0052 0.9833
dispcorr: -0.077815847 hartree
energy: -1406.318427625489
dipole: 11.48831 -5.15281 6.33550 1.47108 -0.31009 1.16099 -2.17645 0.96670 -1.20975
magnitude: 6.55362 au
magnitude: 16.65798 debye
zeropoint: 0.30961313 hartree
thermalvibcorrection: 0.01855903 hartree
thermalrotcorrection: 0.00141627 hartree
thermaltrasncorrection: 0.00141627 hartree
thermaltotal: -1405.98742292 hartree
thermalcorr: 0.02139157 hartree
nonthermalcorr: 0.30961313 hartree
totalcorr: 0.33100470 hartree
totalenthalpy: -1405.98647871 hartree
