program: Orca
programVersion: 5.0.2
elementType: N H C H C O C C O N H C H H H O H H S H C O C H H C H H C H N H H C O O H H
charge: 1
multiplicity: 1
keywords: wB97X-D3BJ Opt Freq def2-TZVPP def2/J RIJCOSX VeryTightSCF
keywords: PAL8 defgrid3 TightOpt
frequency: 0.00 0.00 0.00 0.00 0.00 0.00 26.27 37.66 49.72 53.08 57.90 67.04 96.94 109.05 118.12 133.85 159.63 183.44 185.62 195.93 212.58 228.19 239.91 278.39 295.11 319.89 329.68 336.22 355.91 395.68 404.90 439.34 476.33 492.65 503.45 518.78 558.04 601.87 605.25 624.77 644.57 663.69 693.32 751.60 772.83 791.58 801.93 817.07 843.82 866.00 887.43 897.14 938.04 956.35 985.81 1011.94 1024.89 1026.48 1056.96 1075.21 1100.32 1119.74 1150.50 1175.17 1191.90 1208.68 1216.06 1218.58 1258.31 1271.48 1288.36 1304.04 1323.11 1343.20 1355.20 1363.52 1375.80 1391.65 1399.85 1413.39 1450.59 1467.69 1473.80 1488.66 1495.81 1503.90 1509.48 1514.22 1531.06 1570.09 1663.85 1678.78 1731.86 1805.45 1811.79 1852.02 2760.73 3043.84 3080.47 3098.42 3105.97 3106.52 3107.42 3115.62 3138.42 3149.98 3166.49 3195.01 3227.20 3407.86 3531.09 3650.50 3691.52 3782.48
frequency: 26.27 37.66 49.72 53.08 57.90 67.04 96.94 109.05 118.12 133.85 159.63 183.44 185.62 195.93 212.58 228.19 239.91 278.39 295.11 319.89 329.68 336.22 355.91 395.68 404.90 439.34 476.33 492.65 503.45 518.78 558.04 601.87 605.25 624.77 644.57 663.69 693.32 751.60 772.83 791.58 801.93 817.07 843.82 866.00 887.43 897.14 938.04 956.35 985.81 1011.94 1024.89 1026.48 1056.96 1075.21 1100.32 1119.74 1150.50 1175.17 1191.90 1208.68 1216.06 1218.58 1258.31 1271.48 1288.36 1304.04 1323.11 1343.20 1355.20 1363.52 1375.80 1391.65 1399.85 1413.39 1450.59 1467.69 1473.80 1488.66 1495.81 1503.90 1509.48 1514.22 1531.06 1570.09 1663.85 1678.78 1731.86 1805.45 1811.79 1852.02 2760.73 3043.84 3080.47 3098.42 3105.97 3106.52 3107.42 3115.62 3138.42 3149.98 3166.49 3195.01 3227.20 3407.86 3531.09 3650.50 3691.52 3782.48
formula: C10H18N3O6S
InChI: InChI=1S/C10H18N3O6S/c11-5(10(18)19)1-2-7(14)13-6(4-20)9(17)12-3-8(15)16/h5-6,12-13,15,18,20H,1-4H2,11H3
38 atoms
N  -0.546634 -3.15924 1.573983
H  -0.728185 -3.690649 0.741095
C  -0.226932 -3.876276 2.802482
H  -0.872974 -3.533741 3.613095
C  1.238543 -3.648154 3.172784
O  2.110595 -4.46874 2.961264
C  -0.57266 -1.809999 1.537005
C  -0.894469 -1.116138 0.205539
O  -0.324246 -1.138927 2.534252
N  0.021699 -0.013391 -0.013587
H  -1.871325 -0.654773 0.369381
C  -1.038114 -2.044571 -1.005218
H  -0.3622 0.91713 0.035853
H  -0.146249 -2.656155 -1.153546
H  -1.897766 -2.700119 -0.859324
O  1.538316 -2.474744 3.699899
H  0.776742 -1.850342 3.557358
H  -0.378362 -4.939855 2.640382
S  -1.321479 -1.018579 -2.473849
H  -1.999944 -1.942732 -3.162641
C  1.389558 -0.022643 0.0317
O  2.024568 1.008775 0.054942
C  2.121249 -1.359495 0.018249
H  1.466579 -2.20831 0.210192
H  2.526869 -1.484547 -0.988591
C  3.247991 -1.333754 1.050795
H  2.81138 -1.154736 2.03457
H  3.914593 -0.497767 0.839295
C  4.024581 -2.658299 1.096074
H  3.406791 -3.478405 0.723883
N  4.404778 -3.036868 2.49523
H  5.314137 -3.512428 2.464327
H  4.503866 -2.213636 3.087534
C  5.317946 -2.656469 0.29009
O  6.369925 -3.002784 0.759521
O  5.118047 -2.251665 -0.956059
H  5.959399 -2.266981 -1.435637
H  3.65848 -3.649963 2.895828
totalener: -1406.22819803 hartree
nucrepener: 1890.99543286 hartree
electener: -3297.22363088 hartree
oneelecener: -5664.56679305 hartree
twoeener: 2367.34316217 hartree
kineticenergy: 1400.63539694 hartree
exchangeener: -105.322001256122 hartree
correlationener: -7.057166436286 hartree
xcener: -112.379167692408 hartree
temp: 298.15 k
press: 1.00 atm
thermalcorrenthalpy: 0.00094421 hartree
totalenthalpy: -1405.98172541 hartree
totalentropycorr: -0.06508447 hartree
gibbsenthalpy: -1406.04680988 hartree
gibbsminuselec: 0.26364775 hartree
chargesum: 1.0000000
charge: -0.182125 0.196680 -0.125479 0.166923 0.345998 -0.352678 0.199342 0.085930 -0.373283 -0.200228 0.137011 -0.255558 0.200597 0.112646 0.137091 -0.281521 0.258081 0.144848 -0.104929 0.115729 0.201921 -0.321193 -0.109962 0.008673 0.157986 -0.219994 0.107225 0.163861 -0.001892 0.138270 -0.050325 0.227681 0.228544 0.291597 -0.296881 -0.239262 0.253290 0.235388
charge: 0.338608 -0.020669 -0.020824 0.039907 -0.426435 0.133670 -0.354971 -0.153809 0.146268 0.332441 0.054647 -0.251371 -0.006279 -0.010226 0.005111 0.372087 -0.149706 0.041762 0.499572 -0.145018 -0.375963 0.112619 -0.006281 0.007626 0.041062 -0.001699 0.025057 0.041499 -0.046434 0.044416 0.612373 0.037180 0.049375 -0.433819 0.139299 0.405888 -0.061563 -0.015400
qa: -0.1821 0.1967 -0.1255 0.1669 0.3460 -0.3527 0.1993 0.0859 -0.3733 -0.2002 0.1370 -0.2556 0.2006 0.1126 0.1371 -0.2815 0.2581 0.1448 -0.1049 0.1157 0.2019 -0.3212 -0.1100 0.0087 0.1580 -0.2200 0.1072 0.1639 -0.0019 0.1383 -0.0503 0.2277 0.2285 0.2916 -0.2969 -0.2393 0.2533 0.2354
va: 3.1727 1.0054 3.8987 0.9945 4.1210 2.1595 4.2480 3.7611 2.1563 3.0837 1.0068 4.0677 1.0098 0.9811 0.9956 2.2010 1.0638 1.0088 2.1956 1.0197 4.3591 2.2082 3.7526 1.0641 1.0157 3.8560 1.0317 1.0289 3.7808 1.0112 3.5933 1.0081 0.9820 4.3879 2.1967 2.2672 1.0058 1.0709
dispcorr: -0.082693177 hartree
energy: -1406.316118078813
dipole: -1.80096 2.21867 0.41771 -5.83867 3.16969 -2.66897 1.19936 -0.43457 0.76479
magnitude: 2.80763 au
magnitude: 7.13644 debye
zeropoint: 0.31114144 hartree
thermalvibcorrection: 0.01826096 hartree
thermalrotcorrection: 0.00141627 hartree
thermaltrasncorrection: 0.00141627 hartree
thermaltotal: -1405.98388314 hartree
thermalcorr: 0.02109350 hartree
nonthermalcorr: 0.31114144 hartree
totalcorr: 0.33223494 hartree
totalenthalpy: -1405.98293893 hartree
