program: Orca
programVersion: 5.0.2
elementType: N H C H C O C C O N H C H H H O H H S H C O C H H C H H C H N H H C O O H H
charge: 1
multiplicity: 1
keywords: wB97X-D3BJ Opt Freq def2-TZVPP def2/J RIJCOSX VeryTightSCF
keywords: PAL8 defgrid3 TightOpt
frequency: 0.00 0.00 0.00 0.00 0.00 0.00 33.42 39.95 43.24 58.33 64.46 85.47 96.22 106.31 116.38 132.15 144.34 184.60 202.28 223.35 228.74 259.40 279.19 313.63 321.67 333.87 345.46 357.51 366.57 388.37 441.24 456.85 477.49 516.84 522.11 550.79 562.66 580.70 600.22 608.78 656.93 697.81 701.42 738.51 752.35 763.67 792.22 811.85 825.84 841.56 855.52 874.40 896.88 909.49 937.46 1007.21 1024.06 1028.23 1044.60 1067.68 1114.73 1126.83 1148.82 1156.53 1161.77 1178.37 1237.17 1240.15 1265.66 1282.56 1301.24 1306.04 1315.27 1337.95 1347.04 1355.37 1372.23 1377.80 1390.98 1402.82 1409.48 1454.99 1461.96 1463.58 1469.82 1483.03 1495.32 1518.62 1544.89 1562.75 1620.80 1668.59 1714.26 1795.07 1846.71 1909.74 2514.59 2768.29 3092.40 3100.41 3108.85 3110.24 3127.88 3133.20 3156.52 3167.79 3171.75 3179.97 3373.80 3504.37 3519.94 3574.45 3701.84 3784.90
frequency: 33.42 39.95 43.24 58.33 64.46 85.47 96.22 106.31 116.38 132.15 144.34 184.60 202.28 223.35 228.74 259.40 279.19 313.63 321.67 333.87 345.46 357.51 366.57 388.37 441.24 456.85 477.49 516.84 522.11 550.79 562.66 580.70 600.22 608.78 656.93 697.81 701.42 738.51 752.35 763.67 792.22 811.85 825.84 841.56 855.52 874.40 896.88 909.49 937.46 1007.21 1024.06 1028.23 1044.60 1067.68 1114.73 1126.83 1148.82 1156.53 1161.77 1178.37 1237.17 1240.15 1265.66 1282.56 1301.24 1306.04 1315.27 1337.95 1347.04 1355.37 1372.23 1377.80 1390.98 1402.82 1409.48 1454.99 1461.96 1463.58 1469.82 1483.03 1495.32 1518.62 1544.89 1562.75 1620.80 1668.59 1714.26 1795.07 1846.71 1909.74 2514.59 2768.29 3092.40 3100.41 3108.85 3110.24 3127.88 3133.20 3156.52 3167.79 3171.75 3179.97 3373.80 3504.37 3519.94 3574.45 3701.84 3784.90
formula: C10H18N3O6S
InChI: InChI=1S/C10H18N3O6S/c11-5(10(18)19)1-2-7(14)13-6(4-20)9(17)12-3-8(15)16/h5-6,12-13,15,18,20H,1-4H2,11H3
38 atoms
N  -0.744571 -1.91467 -2.383312
H  0.162202 -2.2653 -2.13508
C  -1.224387 -2.170021 -3.721856
H  -0.511737 -2.826408 -4.224354
C  -1.395496 -0.939291 -4.591417
O  -2.201932 -0.82329 -5.45804
C  -1.538894 -1.273784 -1.489283
C  -0.955929 -1.097895 -0.069926
O  -2.6357 -0.855647 -1.79771
N  -0.011538 0.012365 -0.060329
H  -0.435304 -2.013896 0.210908
C  -2.069059 -0.847907 0.955278
H  -0.452346 0.927659 -0.023943
H  -2.860832 -1.581446 0.81687
H  -1.658546 -0.978508 1.957153
O  -0.474187 0.050658 -4.33374
H  -0.690527 0.775235 -4.937836
H  -2.196045 -2.662221 -3.703153
S  -2.76477 0.821343 0.937244
H  -3.422129 0.693607 -0.220125
C  1.318086 0.012438 -0.029266
O  1.935878 1.093651 -0.034757
C  2.071863 -1.303541 0.039645
H  2.071631 -1.613182 1.088827
H  1.550813 -2.085257 -0.506397
C  3.525358 -1.229142 -0.447205
H  3.907296 -2.247341 -0.506677
H  4.144995 -0.705084 0.28366
C  3.738145 -0.565537 -1.822171
H  4.638841 -0.961503 -2.292352
N  3.910988 0.912995 -1.644573
H  3.151148 1.19348 -0.929792
H  4.833337 1.133321 -1.276747
C  2.566431 -0.862967 -2.754188
O  2.208678 -1.993149 -2.956543
O  2.000897 0.231354 -3.238728
H  1.157212 0.027395 -3.710787
H  3.764258 1.419642 -2.515651
totalener: -1406.23593239 hartree
nucrepener: 1930.59490204 hartree
electener: -3336.83083443 hartree
oneelecener: -5744.49601608 hartree
twoeener: 2407.66518165 hartree
kineticenergy: 1400.63172130 hartree
exchangeener: -105.320624415939 hartree
correlationener: -7.058555643882 hartree
xcener: -112.379180059821 hartree
temp: 298.15 k
press: 1.00 atm
thermalcorrenthalpy: 0.00094421 hartree
totalenthalpy: -1405.99143935 hartree
totalentropycorr: -0.06454048 hartree
gibbsenthalpy: -1406.05597983 hartree
gibbsminuselec: 0.26282428 hartree
chargesum: 1.0000000
charge: -0.226335 0.195390 -0.105843 0.138814 0.305661 -0.239923 0.265997 -0.043420 -0.359554 -0.102586 0.127616 -0.158496 0.185392 0.134056 0.130878 -0.310570 0.245851 0.158167 -0.156096 0.145109 0.241770 -0.398160 -0.195435 0.151383 0.120747 -0.223912 0.140253 0.127672 -0.007443 0.165098 -0.063310 0.230637 0.219437 0.307874 -0.318028 -0.305197 0.255667 0.220839
charge: 0.321944 -0.046712 -0.037637 0.042090 -0.405396 0.172640 -0.382721 -0.128930 0.117166 0.364160 0.031870 -0.229605 -0.017709 0.017487 0.012378 0.370275 -0.080852 0.047442 0.504633 -0.141138 -0.347354 0.136958 -0.006808 0.049516 0.021363 0.013672 0.045191 0.035166 -0.044565 0.046223 0.594072 -0.071929 0.037655 -0.453700 0.137580 0.375276 -0.132634 0.032933
qa: -0.2263 0.1954 -0.1058 0.1388 0.3057 -0.2399 0.2660 -0.0434 -0.3596 -0.1026 0.1276 -0.1585 0.1854 0.1341 0.1309 -0.3106 0.2459 0.1582 -0.1561 0.1451 0.2418 -0.3982 -0.1954 0.1514 0.1207 -0.2239 0.1403 0.1277 -0.0074 0.1651 -0.0633 0.2306 0.2194 0.3079 -0.3180 -0.3052 0.2557 0.2208
va: 3.1383 1.0134 3.8433 0.9998 4.2051 2.2713 4.2051 3.9059 2.1508 3.1370 1.0008 3.9902 1.0660 1.0055 0.9997 2.1169 1.0135 1.0156 2.1874 1.0234 4.2129 2.1062 3.7935 0.9996 1.0147 3.9348 1.0053 1.0069 3.8016 0.9955 3.5593 1.0951 0.9826 4.3362 2.1896 2.2039 1.0834 0.9945
dispcorr: -0.082943623 hartree
energy: -1406.324755373690
dipole: 12.97502 -7.82158 5.15343 -4.09141 4.12914 0.03773 6.10280 -5.58138 0.52142
magnitude: 5.17988 au
magnitude: 13.16621 debye
zeropoint: 0.31028728 hartree
thermalvibcorrection: 0.01787446 hartree
thermalrotcorrection: 0.00141627 hartree
thermaltrasncorrection: 0.00141627 hartree
thermaltotal: -1405.99376108 hartree
thermalcorr: 0.02070701 hartree
nonthermalcorr: 0.31028728 hartree
totalcorr: 0.33099429 hartree
totalenthalpy: -1405.99281687 hartree
