program: Orca
programVersion: 5.0.2
elementType: N H C H C O C C O N H C H H H O H H S H C O C H H C H H C H N H H C O O H H
charge: 1
multiplicity: 1
keywords: wB97X-D3BJ Opt Freq def2-TZVPP def2/J RIJCOSX VeryTightSCF
keywords: PAL8 defgrid3 TightOpt
frequency: 0.00 0.00 0.00 0.00 0.00 0.00 25.26 29.12 40.98 61.96 67.23 76.17 90.74 96.92 114.96 137.61 154.35 172.24 180.63 210.22 219.15 222.97 229.59 242.54 276.95 315.74 325.05 350.50 367.63 392.59 457.66 470.49 486.58 523.58 526.91 551.15 554.39 586.88 617.87 635.63 648.64 653.92 679.40 738.95 751.92 779.39 781.23 792.63 828.72 841.25 883.24 890.37 892.86 937.69 942.86 1008.06 1014.52 1035.22 1043.45 1051.75 1101.53 1116.05 1125.04 1161.60 1173.54 1201.67 1233.92 1237.58 1257.82 1283.57 1290.88 1325.26 1329.76 1333.26 1343.21 1349.10 1369.84 1385.36 1393.50 1402.59 1424.63 1452.45 1470.82 1471.85 1481.96 1486.71 1489.67 1494.57 1580.94 1583.45 1664.61 1679.25 1725.21 1799.94 1816.32 1895.80 2759.61 3047.52 3081.18 3095.65 3106.59 3111.61 3115.45 3122.05 3127.38 3172.56 3178.93 3200.94 3223.19 3488.52 3546.91 3616.76 3664.94 3785.03
frequency: 25.26 29.12 40.98 61.96 67.23 76.17 90.74 96.92 114.96 137.61 154.35 172.24 180.63 210.22 219.15 222.97 229.59 242.54 276.95 315.74 325.05 350.50 367.63 392.59 457.66 470.49 486.58 523.58 526.91 551.15 554.39 586.88 617.87 635.63 648.64 653.92 679.40 738.95 751.92 779.39 781.23 792.63 828.72 841.25 883.24 890.37 892.86 937.69 942.86 1008.06 1014.52 1035.22 1043.45 1051.75 1101.53 1116.05 1125.04 1161.60 1173.54 1201.67 1233.92 1237.58 1257.82 1283.57 1290.88 1325.26 1329.76 1333.26 1343.21 1349.10 1369.84 1385.36 1393.50 1402.59 1424.63 1452.45 1470.82 1471.85 1481.96 1486.71 1489.67 1494.57 1580.94 1583.45 1664.61 1679.25 1725.21 1799.94 1816.32 1895.80 2759.61 3047.52 3081.18 3095.65 3106.59 3111.61 3115.45 3122.05 3127.38 3172.56 3178.93 3200.94 3223.19 3488.52 3546.91 3616.76 3664.94 3785.03
formula: C10H18N3O6S
InChI: InChI=1S/C10H18N3O6S/c11-5(10(18)19)1-2-7(14)13-6(4-20)9(17)12-3-8(15)16/h5-6,12-13,15,18,20H,1-4H2,11H3
38 atoms
N  -0.153154 -1.176057 -2.554571
H  -0.001122 -0.186191 -2.45151
C  0.233865 -1.833785 -3.79472
H  -0.575416 -2.47037 -4.156122
C  1.481984 -2.6585 -3.498625
O  2.606133 -2.30525 -3.788561
C  -0.645147 -1.870917 -1.514865
C  -0.82852 -1.126647 -0.191582
O  -0.87824 -3.078751 -1.581991
N  0.036355 0.021749 -0.065607
H  -0.596029 -1.871036 0.574231
C  -2.298639 -0.73083 -0.001837
H  -0.385538 0.933393 -0.169993
H  -2.915513 -1.615607 -0.15379
H  -2.455651 -0.387869 1.01879
O  1.291213 -3.768301 -2.790068
H  0.356146 -3.791746 -2.4513
H  0.475099 -1.082302 -4.540775
S  -2.868775 0.541182 -1.162884
H  -2.781117 1.587925 -0.335406
C  1.405025 0.038731 -0.132908
O  2.009317 1.083574 -0.241757
C  2.152966 -1.29297 -0.052067
H  2.208213 -1.572826 1.00428
H  1.600999 -2.085943 -0.561104
C  3.555409 -1.10513 -0.631914
H  4.080343 -0.357916 -0.039691
H  3.493679 -0.701417 -1.644476
C  4.434468 -2.350468 -0.659915
H  5.430387 -2.060995 -1.003589
N  3.945803 -3.377015 -1.644294
H  3.09357 -3.840624 -1.326587
H  3.68704 -2.949375 -2.563707
C  4.616752 -2.980711 0.718242
O  4.724332 -2.342146 1.719195
O  4.663724 -4.325183 0.648078
H  4.824674 -4.676324 1.5359
H  4.639732 -4.109277 -1.785909
totalener: -1406.23303469 hartree
nucrepener: 1896.56742837 hartree
electener: -3302.80046306 hartree
oneelecener: -5675.62596698 hartree
twoeener: 2372.82550392 hartree
kineticenergy: 1400.63943051 hartree
exchangeener: -105.320869796095 hartree
correlationener: -7.057909539173 hartree
xcener: -112.378779335267 hartree
temp: 298.15 k
press: 1.00 atm
thermalcorrenthalpy: 0.00094421 hartree
totalenthalpy: -1405.98789673 hartree
totalentropycorr: -0.06511382 hartree
gibbsenthalpy: -1406.05301055 hartree
gibbsminuselec: 0.26311245 hartree
chargesum: 1.0000000
charge: -0.158212 0.204552 -0.113048 0.162001 0.337792 -0.338145 0.198928 0.019176 -0.383683 -0.217587 0.141813 -0.180480 0.179278 0.147071 0.148507 -0.310034 0.259393 0.144908 -0.138898 0.117162 0.188725 -0.310372 -0.197083 0.157300 0.052734 -0.177667 0.162587 0.124521 -0.009421 0.161902 -0.069059 0.220738 0.231503 0.278955 -0.236941 -0.292611 0.257851 0.235843
charge: 0.349689 -0.013095 -0.018546 0.039461 -0.421686 0.139561 -0.375018 -0.156363 0.123263 0.318310 0.045088 -0.221845 -0.025865 0.021772 0.016368 0.359317 -0.147714 0.043499 0.497031 -0.147123 -0.381825 0.113868 -0.010639 0.040663 0.011710 -0.000830 0.053613 0.035982 -0.049843 0.054313 0.604095 0.035987 -0.006904 -0.436989 0.175357 0.354349 -0.067334 0.048325
qa: -0.1582 0.2046 -0.1130 0.1620 0.3378 -0.3381 0.1989 0.0192 -0.3837 -0.2176 0.1418 -0.1805 0.1793 0.1471 0.1485 -0.3100 0.2594 0.1449 -0.1389 0.1172 0.1887 -0.3104 -0.1971 0.1573 0.0527 -0.1777 0.1626 0.1245 -0.0094 0.1619 -0.0691 0.2207 0.2315 0.2790 -0.2369 -0.2926 0.2579 0.2358
va: 3.1885 1.0176 3.8683 0.9971 4.1306 2.1685 4.1528 3.9267 2.1459 3.0632 1.0049 3.9183 1.0506 1.0058 0.9934 2.1646 1.0633 1.0095 2.1783 1.0181 4.3402 2.2052 3.7643 1.0150 1.0229 3.8992 1.0202 1.0248 3.7668 0.9947 3.6094 1.0114 1.0699 4.3724 2.2666 2.1956 1.0062 0.9784
dispcorr: -0.083488378 hartree
energy: -1406.322463802211
dipole: 1.75779 -0.36866 1.38913 -1.81055 -0.27827 -2.08882 0.20388 -0.60173 -0.39784
magnitude: 2.53991 au
magnitude: 6.45593 debye
zeropoint: 0.31071106 hartree
thermalvibcorrection: 0.01829604 hartree
thermalrotcorrection: 0.00141627 hartree
thermaltrasncorrection: 0.00141627 hartree
thermaltotal: -1405.99062416 hartree
thermalcorr: 0.02112859 hartree
nonthermalcorr: 0.31071106 hartree
totalcorr: 0.33183965 hartree
totalenthalpy: -1405.98967995 hartree
