program: Orca
programVersion: 5.0.2
elementType: N H C H C O C C O N H C H H H O H H S H C O C H H C H H C H N H H C O O H H
charge: 1
multiplicity: 1
keywords: wB97X-D3BJ Opt Freq def2-TZVPP def2/J RIJCOSX VeryTightSCF
keywords: PAL8 defgrid3 TightOpt
frequency: 0.00 0.00 0.00 0.00 0.00 0.00 26.83 35.63 47.10 56.04 71.53 83.06 90.72 103.34 107.65 120.42 150.99 161.43 185.11 227.63 230.81 242.50 246.82 278.48 287.67 297.69 328.16 335.23 361.64 390.86 444.98 463.80 478.36 494.62 525.86 542.85 556.56 604.45 630.00 649.54 657.31 679.41 690.59 711.17 758.12 777.49 787.32 834.03 852.25 878.60 906.57 916.21 925.47 940.63 969.08 981.77 1019.98 1041.74 1056.93 1078.16 1119.68 1146.01 1151.33 1158.66 1171.78 1224.64 1232.26 1239.15 1272.46 1284.12 1290.24 1309.02 1322.95 1344.13 1351.98 1358.43 1361.97 1382.12 1387.80 1412.11 1459.47 1466.16 1477.93 1483.31 1485.84 1503.74 1517.88 1528.48 1541.21 1560.28 1597.37 1679.95 1729.09 1786.13 1791.13 1823.93 2702.47 2767.14 3047.85 3085.23 3087.76 3099.08 3108.96 3132.53 3136.88 3148.85 3159.37 3164.65 3180.93 3460.43 3572.05 3609.25 3706.58 3790.58
frequency: 26.83 35.63 47.10 56.04 71.53 83.06 90.72 103.34 107.65 120.42 150.99 161.43 185.11 227.63 230.81 242.50 246.82 278.48 287.67 297.69 328.16 335.23 361.64 390.86 444.98 463.80 478.36 494.62 525.86 542.85 556.56 604.45 630.00 649.54 657.31 679.41 690.59 711.17 758.12 777.49 787.32 834.03 852.25 878.60 906.57 916.21 925.47 940.63 969.08 981.77 1019.98 1041.74 1056.93 1078.16 1119.68 1146.01 1151.33 1158.66 1171.78 1224.64 1232.26 1239.15 1272.46 1284.12 1290.24 1309.02 1322.95 1344.13 1351.98 1358.43 1361.97 1382.12 1387.80 1412.11 1459.47 1466.16 1477.93 1483.31 1485.84 1503.74 1517.88 1528.48 1541.21 1560.28 1597.37 1679.95 1729.09 1786.13 1791.13 1823.93 2702.47 2767.14 3047.85 3085.23 3087.76 3099.08 3108.96 3132.53 3136.88 3148.85 3159.37 3164.65 3180.93 3460.43 3572.05 3609.25 3706.58 3790.58
formula: C10H18N3O6S
InChI: InChI=1S/C10H18N3O6S/c11-5(10(18)19)1-2-7(14)13-6(4-20)9(17)12-3-8(15)16/h5-6,12-13,15,18,20H,1-4H2,11H3
38 atoms
N  -0.842014 -0.92832 -2.501248
H  -0.231482 -0.139742 -2.390915
C  -1.319714 -1.277287 -3.815673
H  -2.407046 -1.348615 -3.824374
C  -0.76063 -2.590223 -4.331712
O  0.345802 -3.03176 -4.094913
C  -1.272266 -1.647648 -1.434665
C  -0.88807 -1.153101 -0.030913
O  -1.957442 -2.641775 -1.558347
N  -0.00157 0.003242 -0.026232
H  -0.399333 -1.987482 0.472247
C  -2.16929 -0.833214 0.736578
H  -0.420603 0.918101 0.073149
H  -2.711178 -0.024022 0.241371
H  -2.791839 -1.72412 0.732521
O  -1.610299 -3.199612 -5.138623
H  -1.200753 -4.009247 -5.475644
H  -1.016784 -0.501846 -4.521388
S  -1.719923 -0.364252 2.429917
H  -2.956973 -0.412036 2.934196
C  1.338642 0.001512 -0.033145
O  1.960649 1.072726 -0.033937
C  2.048294 -1.336487 -0.033761
H  1.968374 -1.739603 0.980368
H  1.52464 -2.040971 -0.679631
C  3.527625 -1.273241 -0.426008
H  3.911365 -2.29267 -0.433075
H  4.100503 -0.724873 0.324936
C  3.812345 -0.6622 -1.809876
H  4.751736 -1.047444 -2.206589
N  3.910131 0.829508 -1.722585
H  3.605935 1.242254 -2.607292
H  3.213432 1.127633 -0.972071
C  2.689498 -0.969679 -2.798601
O  2.036956 -0.081098 -3.304626
O  2.524744 -2.253274 -2.949349
H  1.68273 -2.470881 -3.453332
H  4.848153 1.1417 -1.487551
totalener: -1406.25603731 hartree
nucrepener: 1916.09934711 hartree
electener: -3322.35538442 hartree
oneelecener: -5715.92549386 hartree
twoeener: 2393.57010943 hartree
kineticenergy: 1400.66022854 hartree
exchangeener: -105.335898771293 hartree
correlationener: -7.059517082283 hartree
xcener: -112.395415853576 hartree
temp: 298.15 k
press: 1.00 atm
thermalcorrenthalpy: 0.00094421 hartree
totalenthalpy: -1406.01058389 hartree
totalentropycorr: -0.06477848 hartree
gibbsenthalpy: -1406.07536236 hartree
gibbsminuselec: 0.26302691 hartree
chargesum: 1.0000000
charge: -0.207936 0.189957 -0.091696 0.152770 0.373916 -0.357844 0.191781 0.030842 -0.338654 -0.199269 0.133239 -0.181095 0.211577 0.116600 0.148067 -0.226757 0.246607 0.140061 -0.144350 0.125485 0.245459 -0.388594 -0.174267 0.152180 0.130483 -0.230242 0.139665 0.131491 -0.004366 0.161952 -0.063625 0.221776 0.228747 0.304564 -0.367593 -0.288385 0.266272 0.221185
charge: 0.327705 -0.039604 -0.036696 0.043617 -0.395037 0.176295 -0.390426 -0.142500 0.114016 0.354894 0.041306 -0.225229 0.001420 0.005210 0.019156 0.412991 -0.068024 0.043471 0.471573 -0.139904 -0.349721 0.131342 -0.006189 0.050529 0.034080 0.009789 0.045392 0.035174 -0.047034 0.043423 0.602029 0.035494 -0.056002 -0.471729 0.096579 0.399949 -0.163914 0.036577
qa: -0.2079 0.1900 -0.0917 0.1528 0.3739 -0.3578 0.1918 0.0308 -0.3387 -0.1993 0.1332 -0.1811 0.2116 0.1166 0.1481 -0.2268 0.2466 0.1401 -0.1444 0.1255 0.2455 -0.3886 -0.1743 0.1522 0.1305 -0.2302 0.1397 0.1315 -0.0044 0.1620 -0.0636 0.2218 0.2287 0.3046 -0.3676 -0.2884 0.2663 0.2212
va: 3.1354 1.0200 3.8674 1.0155 4.1625 2.1200 4.2730 3.8349 2.2047 3.1368 1.0160 4.0433 1.0063 0.9984 1.0151 2.2962 1.0129 1.0028 2.1766 1.0197 4.2195 2.1176 3.7452 1.0005 1.0223 3.9466 1.0072 1.0068 3.8107 0.9999 3.5959 1.0043 1.0889 4.3287 2.1086 2.2535 1.0838 0.9818
dispcorr: -0.082473982 hartree
energy: -1406.343993276254
dipole: 6.90740 -3.92853 2.97886 3.10277 -1.70037 1.40241 3.23511 -3.90747 -0.67237
magnitude: 3.36043 au
magnitude: 8.54152 debye
zeropoint: 0.31036507 hartree
thermalvibcorrection: 0.01814157 hartree
thermalrotcorrection: 0.00141627 hartree
thermaltrasncorrection: 0.00141627 hartree
thermaltotal: -1406.01265409 hartree
thermalcorr: 0.02097412 hartree
nonthermalcorr: 0.31036507 hartree
totalcorr: 0.33133919 hartree
totalenthalpy: -1406.01170988 hartree
