program: Orca
programVersion: 5.0.2
elementType: N H C H C O C C O N H C H H H O H H S H C O C H H C H H C H N H H C O O H H
charge: 1
multiplicity: 1
keywords: wB97X-D3BJ Opt Freq def2-TZVPP def2/J RIJCOSX VeryTightSCF
keywords: PAL8 defgrid3 TightOpt
frequency: 0.00 0.00 0.00 0.00 0.00 0.00 -12.36 15.18 18.98 22.18 32.34 60.05 69.90 77.63 91.77 111.96 121.99 151.00 172.30 221.52 232.61 247.55 282.95 298.22 299.23 323.88 340.69 345.85 369.98 423.96 458.71 475.51 501.04 517.39 518.21 536.77 545.25 572.79 584.82 633.88 643.95 654.18 662.41 670.09 729.25 748.94 770.39 799.32 808.76 831.60 869.55 891.90 917.93 922.56 952.51 1001.02 1035.18 1056.04 1068.31 1115.66 1133.53 1138.12 1146.76 1166.93 1168.32 1201.16 1204.65 1218.21 1241.11 1269.50 1283.90 1290.00 1316.99 1333.33 1338.94 1359.36 1369.02 1369.90 1375.27 1417.35 1423.60 1451.45 1455.02 1475.16 1481.34 1502.63 1504.58 1509.69 1538.90 1592.02 1642.96 1701.67 1715.15 1786.96 1841.45 1893.66 2438.27 2722.58 3079.37 3093.07 3097.43 3103.01 3114.42 3133.84 3152.26 3155.33 3166.66 3196.15 3504.66 3566.16 3609.97 3679.49 3785.10 3800.26
frequency: 15.18 18.98 22.18 32.34 60.05 69.90 77.63 91.77 111.96 121.99 151.00 172.30 221.52 232.61 247.55 282.95 298.22 299.23 323.88 340.69 345.85 369.98 423.96 458.71 475.51 501.04 517.39 518.21 536.77 545.25 572.79 584.82 633.88 643.95 654.18 662.41 670.09 729.25 748.94 770.39 799.32 808.76 831.60 869.55 891.90 917.93 922.56 952.51 1001.02 1035.18 1056.04 1068.31 1115.66 1133.53 1138.12 1146.76 1166.93 1168.32 1201.16 1204.65 1218.21 1241.11 1269.50 1283.90 1290.00 1316.99 1333.33 1338.94 1359.36 1369.02 1369.90 1375.27 1417.35 1423.60 1451.45 1455.02 1475.16 1481.34 1502.63 1504.58 1509.69 1538.90 1592.02 1642.96 1701.67 1715.15 1786.96 1841.45 1893.66 2438.27 2722.58 3079.37 3093.07 3097.43 3103.01 3114.42 3133.84 3152.26 3155.33 3166.66 3196.15 3504.66 3566.16 3609.97 3679.49 3785.10 3800.26
formula: C10H18N3O6S
InChI: InChI=1S/C10H18N3O6S/c11-5(10(18)19)1-2-7(14)13-6(4-20)9(17)12-3-8(15)16/h5-6,12-13,15,18,20H,1-4H2,11H3
38 atoms
N  -2.125257 -1.31076 -2.159322
H  -2.907129 -0.93018 -1.654816
C  -2.421597 -1.884336 -3.45164
H  -2.614193 -1.112325 -4.199654
C  -3.636752 -2.786948 -3.357989
O  -4.277927 -2.957156 -2.352507
C  -1.02537 -1.679156 -1.464523
C  -0.908078 -1.177288 -0.012941
O  -0.103842 -2.316297 -1.940436
N  -0.001097 -0.026645 0.003061
H  -0.446352 -1.994401 0.53722
C  -2.207129 -0.819916 0.702798
H  -0.414604 0.892288 -0.080303
H  -1.95735 -0.417718 1.685852
H  -2.762419 -0.034899 0.183183
O  -3.915744 -3.351516 -4.533112
H  -4.701905 -3.904566 -4.426591
H  -1.560637 -2.463605 -3.783619
S  -3.248164 -2.257301 1.038947
H  -3.632702 -2.521421 -0.218473
C  1.332915 -0.026079 -0.018673
O  1.946702 1.059429 -0.058911
C  2.12121 -1.319777 0.008707
H  1.49436 -2.186386 -0.175599
H  2.784154 -1.264384 -0.858844
C  2.935548 -1.539882 1.297275
H  3.637996 -2.355889 1.113578
H  2.290469 -1.878158 2.107877
C  3.700277 -0.322448 1.829681
H  3.007422 0.365568 2.319512
N  4.307699 0.471826 0.718772
H  4.890202 -0.100802 0.111451
H  3.439348 0.855956 0.189447
C  4.723718 -0.734083 2.880593
O  4.496699 -1.549833 3.720616
O  5.876327 -0.051495 2.752196
H  6.476744 -0.32269 3.461694
H  4.88802 1.226104 1.080884
totalener: -1406.23684593 hartree
nucrepener: 1749.95723458 hartree
electener: -3156.19408052 hartree
oneelecener: -5384.56706873 hartree
twoeener: 2228.37298822 hartree
kineticenergy: 1400.63669928 hartree
exchangeener: -105.319672624001 hartree
correlationener: -7.051347157467 hartree
xcener: -112.371019781467 hartree
temp: 298.15 k
press: 1.00 atm
thermalcorrenthalpy: 0.00094421 hartree
totalenthalpy: -1405.98568927 hartree
totalentropycorr: -0.06650162 hartree
gibbsenthalpy: -1406.05219088 hartree
gibbsminuselec: 0.26158753 hartree
chargesum: 1.0000000
charge: -0.176091 0.173545 -0.089201 0.142228 0.320123 -0.339400 0.237898 -0.000690 -0.380399 -0.135021 0.118177 -0.185341 0.190453 0.128357 0.110785 -0.254441 0.244632 0.140194 -0.121720 0.129960 0.293399 -0.404464 -0.193041 0.121880 0.136219 -0.196842 0.132205 0.131428 -0.038480 0.162248 -0.061780 0.214591 0.229003 0.270818 -0.244004 -0.291564 0.256842 0.227495
charge: 0.334519 -0.026910 -0.030536 0.035678 -0.434816 0.107929 -0.383917 -0.135997 0.092269 0.365329 0.038250 -0.260289 0.003304 0.016384 -0.000720 0.383038 -0.076726 0.042210 0.505152 -0.153962 -0.325948 0.129849 -0.002051 0.031359 0.039477 0.006219 0.040690 0.044307 -0.059049 0.050092 0.591083 0.038502 -0.066229 -0.435614 0.171395 0.356026 -0.067024 0.036730
qa: -0.1761 0.1735 -0.0892 0.1422 0.3201 -0.3394 0.2379 -0.0007 -0.3804 -0.1350 0.1182 -0.1853 0.1905 0.1284 0.1108 -0.2544 0.2446 0.1402 -0.1217 0.1300 0.2934 -0.4045 -0.1930 0.1219 0.1362 -0.1968 0.1322 0.1314 -0.0385 0.1622 -0.0618 0.2146 0.2290 0.2708 -0.2440 -0.2916 0.2568 0.2275
va: 3.2109 1.0248 3.7998 1.0015 4.2921 2.1247 4.2420 3.8302 2.1434 3.1887 1.0217 4.0210 1.0177 1.0010 0.9963 2.2407 1.0125 1.0353 2.1647 1.0474 4.1617 2.1183 3.8599 1.0501 1.0120 3.8637 1.0047 1.0192 3.8089 0.9983 3.5412 0.9912 1.0982 4.3946 2.2583 2.1960 1.0073 0.9880
dispcorr: -0.077532037 hartree
energy: -1406.318992004824
dipole: 8.13832 -4.40564 3.73268 4.74472 -2.52216 2.22256 0.07188 0.24997 0.32185
magnitude: 4.35618 au
magnitude: 11.07252 debye
zeropoint: 0.31001813 hartree
thermalvibcorrection: 0.01773663 hartree
thermalrotcorrection: 0.00141627 hartree
thermaltrasncorrection: 0.00141627 hartree
thermaltotal: -1405.98840471 hartree
thermalcorr: 0.02056917 hartree
nonthermalcorr: 0.31001813 hartree
totalcorr: 0.33058730 hartree
totalenthalpy: -1405.98746050 hartree
