program: Orca
programVersion: 5.0.2
elementType: N H C H C O C C O N H C H H H O H H S H C O C H H C H H C H N H H C O O H H
charge: 1
multiplicity: 1
keywords: wB97X-D3BJ Opt Freq def2-TZVPP def2/J RIJCOSX VeryTightSCF
keywords: PAL8 defgrid3 TightOpt
frequency: 0.00 0.00 0.00 0.00 0.00 0.00 14.40 26.00 29.50 34.55 51.04 64.09 69.69 80.56 98.21 109.80 134.64 165.31 192.08 198.80 224.88 253.54 280.09 294.13 313.47 320.00 328.96 360.44 374.82 416.18 437.66 481.95 499.64 514.41 522.92 536.38 573.09 584.83 600.38 634.93 645.38 653.00 663.88 669.37 719.35 728.25 740.81 776.86 809.27 853.47 864.50 900.13 907.89 921.67 957.91 1001.34 1010.07 1034.67 1075.73 1081.27 1114.29 1135.04 1148.65 1156.24 1170.80 1197.71 1211.89 1256.49 1263.47 1266.01 1280.97 1310.08 1322.56 1330.71 1339.04 1360.48 1375.76 1383.25 1402.92 1419.93 1425.87 1455.91 1459.58 1469.41 1473.16 1480.60 1492.39 1543.90 1551.05 1587.19 1636.04 1676.70 1707.85 1796.89 1833.17 1892.12 2273.60 2758.84 3074.42 3077.76 3087.62 3098.30 3109.35 3119.08 3151.34 3154.81 3173.25 3205.98 3507.71 3571.40 3617.82 3677.28 3787.70 3806.18
frequency: 14.40 26.00 29.50 34.55 51.04 64.09 69.69 80.56 98.21 109.80 134.64 165.31 192.08 198.80 224.88 253.54 280.09 294.13 313.47 320.00 328.96 360.44 374.82 416.18 437.66 481.95 499.64 514.41 522.92 536.38 573.09 584.83 600.38 634.93 645.38 653.00 663.88 669.37 719.35 728.25 740.81 776.86 809.27 853.47 864.50 900.13 907.89 921.67 957.91 1001.34 1010.07 1034.67 1075.73 1081.27 1114.29 1135.04 1148.65 1156.24 1170.80 1197.71 1211.89 1256.49 1263.47 1266.01 1280.97 1310.08 1322.56 1330.71 1339.04 1360.48 1375.76 1383.25 1402.92 1419.93 1425.87 1455.91 1459.58 1469.41 1473.16 1480.60 1492.39 1543.90 1551.05 1587.19 1636.04 1676.70 1707.85 1796.89 1833.17 1892.12 2273.60 2758.84 3074.42 3077.76 3087.62 3098.30 3109.35 3119.08 3151.34 3154.81 3173.25 3205.98 3507.71 3571.40 3617.82 3677.28 3787.70 3806.18
formula: C10H18N3O6S
InChI: InChI=1S/C10H18N3O6S/c11-5(10(18)19)1-2-7(14)13-6(4-20)9(17)12-3-8(15)16/h5-6,12-13,15,18,20H,1-4H2,11H3
38 atoms
N  -0.483194 -2.19377 1.865082
H  -0.480735 -1.252231 2.218178
C  -0.216159 -3.274302 2.779406
H  -0.99331 -3.357512 3.542599
C  1.122462 -3.121795 3.474838
O  1.920104 -2.24017 3.266496
C  -0.617015 -2.39387 0.53069
C  -0.907572 -1.119606 -0.279358
O  -0.567967 -3.485014 0.001061
N  0.018588 -0.025411 0.002958
H  -1.876709 -0.771806 0.093622
C  -1.095234 -1.39036 -1.773914
H  -0.370854 0.905179 -0.05092
H  -1.825963 -2.186511 -1.900334
H  -1.50316 -0.490786 -2.237159
O  1.305186 -4.094752 4.36702
H  2.163157 -3.966805 4.793548
H  -0.215291 -4.20791 2.215324
S  0.388168 -1.787185 -2.721884
H  0.480567 -3.061646 -2.3255
C  1.362038 -0.011989 0.035122
O  1.927465 1.098257 0.057293
C  2.144817 -1.294348 0.156956
H  2.216505 -1.506898 1.228366
H  1.591491 -2.113341 -0.288222
C  3.537158 -1.272447 -0.480212
H  3.492455 -0.874927 -1.498638
H  3.876595 -2.304999 -0.561072
C  4.615688 -0.538596 0.324399
H  4.501832 -0.779572 1.383378
N  4.463877 0.941068 0.186955
H  4.932667 1.446584 0.934278
H  4.868366 1.26058 -0.691472
C  6.008132 -1.008106 -0.086908
O  6.347315 -2.150321 -0.024732
O  6.782311 0.004194 -0.5205
H  7.645744 -0.355664 -0.769552
H  3.384334 1.135012 0.17681
totalener: -1406.24595625 hartree
nucrepener: 1846.34138119 hartree
electener: -3252.58733744 hartree
oneelecener: -5577.25040132 hartree
twoeener: 2324.66306388 hartree
kineticenergy: 1400.66345290 hartree
exchangeener: -105.327493899309 hartree
correlationener: -7.054701377656 hartree
xcener: -112.382195276965 hartree
temp: 298.15 k
press: 1.00 atm
thermalcorrenthalpy: 0.00094421 hartree
totalenthalpy: -1405.99777668 hartree
totalentropycorr: -0.06600744 hartree
gibbsenthalpy: -1406.06378413 hartree
gibbsminuselec: 0.26198538 hartree
chargesum: 1.0000000
charge: -0.192743 0.178953 -0.087678 0.150677 0.317618 -0.358022 0.225246 0.004421 -0.341267 -0.192617 0.141681 -0.152361 0.195909 0.141554 0.126370 -0.244027 0.240322 0.145203 -0.163453 0.134149 0.289713 -0.398024 -0.137937 0.123866 0.095375 -0.232015 0.118630 0.148122 0.010479 0.143206 -0.075901 0.222042 0.213072 0.275137 -0.250345 -0.288772 0.253594 0.219823
charge: 0.335030 -0.020944 -0.034725 0.038628 -0.431797 0.091659 -0.398410 -0.134655 0.103778 0.348685 0.046979 -0.237981 -0.000170 0.019957 0.012622 0.387840 -0.078661 0.046415 0.504901 -0.141643 -0.319985 0.160974 -0.013174 0.031713 0.023540 0.006115 0.033290 0.048794 -0.055694 0.050926 0.585096 0.034246 0.033626 -0.434346 0.165517 0.355263 -0.068259 -0.095152
qa: -0.1927 0.1790 -0.0877 0.1507 0.3176 -0.3580 0.2252 0.0044 -0.3413 -0.1926 0.1417 -0.1524 0.1959 0.1416 0.1264 -0.2440 0.2403 0.1452 -0.1635 0.1341 0.2897 -0.3980 -0.1379 0.1239 0.0954 -0.2320 0.1186 0.1481 0.0105 0.1432 -0.0759 0.2220 0.2131 0.2751 -0.2503 -0.2888 0.2536 0.2198
va: 3.1839 1.0238 3.7877 1.0024 4.2898 2.1106 4.2648 3.8085 2.1796 3.1520 0.9928 3.9803 1.0088 1.0108 1.0042 2.2467 1.0165 1.0314 2.1831 1.0207 4.1732 2.1220 3.7030 1.0628 1.0807 3.9759 1.0209 1.0129 3.7879 1.0085 3.5224 0.9840 1.0002 4.3811 2.2535 2.1971 1.0091 1.1142
dispcorr: -0.080446868 hartree
energy: -1406.331009369895
dipole: -1.48151 2.88734 1.40583 3.93433 -1.34685 2.58748 -0.44207 1.31833 0.87626
magnitude: 3.07234 au
magnitude: 7.80926 debye
zeropoint: 0.30986892 hartree
thermalvibcorrection: 0.01847343 hartree
thermalrotcorrection: 0.00141627 hartree
thermaltrasncorrection: 0.00141627 hartree
thermaltotal: -1405.99983448 hartree
thermalcorr: 0.02130598 hartree
nonthermalcorr: 0.30986892 hartree
totalcorr: 0.33117489 hartree
totalenthalpy: -1405.99889027 hartree
