program: Orca
programVersion: 5.0.2
elementType: N H C H C O C C O N H C H H H O H H S H C O C H H C H H C H N H H C O O H H
charge: 1
multiplicity: 1
keywords: wB97X-D3BJ Opt Freq def2-TZVPP def2/J RIJCOSX VeryTightSCF
keywords: PAL8 defgrid3 TightOpt
frequency: 0.00 0.00 0.00 0.00 0.00 0.00 14.93 20.89 35.28 41.76 44.80 56.06 60.73 76.98 83.67 107.35 125.99 159.47 173.86 194.22 216.66 253.67 269.24 283.98 298.59 313.08 334.49 345.32 347.59 440.49 466.62 474.41 504.02 509.44 531.28 534.38 556.66 566.22 607.02 613.68 646.91 669.39 673.32 706.83 729.83 745.56 748.33 780.48 833.56 840.97 863.77 881.67 895.46 921.42 958.48 965.24 993.36 1056.26 1064.69 1088.84 1094.92 1106.33 1148.64 1157.97 1164.12 1199.22 1202.62 1240.22 1244.38 1263.43 1273.12 1296.15 1313.34 1332.85 1345.99 1356.52 1372.73 1380.51 1397.65 1403.56 1411.36 1425.48 1461.13 1467.87 1482.76 1498.68 1502.71 1509.47 1547.56 1573.97 1616.33 1705.42 1728.08 1803.68 1879.66 1903.20 2372.46 2766.32 3063.96 3074.48 3098.62 3107.89 3112.86 3122.96 3161.26 3168.31 3171.06 3178.16 3507.07 3579.45 3590.26 3671.70 3799.71 3800.80
frequency: 14.93 20.89 35.28 41.76 44.80 56.06 60.73 76.98 83.67 107.35 125.99 159.47 173.86 194.22 216.66 253.67 269.24 283.98 298.59 313.08 334.49 345.32 347.59 440.49 466.62 474.41 504.02 509.44 531.28 534.38 556.66 566.22 607.02 613.68 646.91 669.39 673.32 706.83 729.83 745.56 748.33 780.48 833.56 840.97 863.77 881.67 895.46 921.42 958.48 965.24 993.36 1056.26 1064.69 1088.84 1094.92 1106.33 1148.64 1157.97 1164.12 1199.22 1202.62 1240.22 1244.38 1263.43 1273.12 1296.15 1313.34 1332.85 1345.99 1356.52 1372.73 1380.51 1397.65 1403.56 1411.36 1425.48 1461.13 1467.87 1482.76 1498.68 1502.71 1509.47 1547.56 1573.97 1616.33 1705.42 1728.08 1803.68 1879.66 1903.20 2372.46 2766.32 3063.96 3074.48 3098.62 3107.89 3112.86 3122.96 3161.26 3168.31 3171.06 3178.16 3507.07 3579.45 3590.26 3671.70 3799.71 3800.80
formula: C10H18N3O6S
InChI: InChI=1S/C10H18N3O6S/c11-5(10(18)19)1-2-7(14)13-6(4-20)9(17)12-3-8(15)16/h5-6,12-13,15,18,20H,1-4H2,11H3
38 atoms
N  -1.131994 -3.389432 -0.811128
H  -1.782896 -3.488081 -0.050745
C  -1.134531 -4.403152 -1.843133
H  -0.152311 -4.456733 -2.309141
C  -2.140884 -4.18393 -2.964237
O  -2.158434 -4.847118 -3.959473
C  -0.609515 -2.165874 -1.067795
C  -0.931409 -1.101639 -0.005972
O  0.060168 -1.915267 -2.047729
N  -0.038021 0.037857 -0.106931
H  -0.861013 -1.548927 0.991546
C  -2.367281 -0.618684 -0.24158
H  -0.476445 0.947294 -0.17642
H  -2.432892 -0.183095 -1.239122
H  -3.045761 -1.467956 -0.194974
O  -3.017815 -3.192046 -2.705552
H  -3.612291 -3.141369 -3.466399
H  -1.345713 -5.37526 -1.397313
S  -2.803277 0.61306 1.018372
H  -3.888496 1.087875 0.398687
C  1.290343 0.061113 -0.105813
O  1.890177 1.149775 -0.222002
C  2.10372 -1.198345 0.098401
H  2.669542 -1.030788 1.020702
H  1.479435 -2.068837 0.284051
C  3.051432 -1.541693 -1.067181
H  2.461949 -1.901738 -1.910095
H  3.690554 -2.361863 -0.735941
C  3.937691 -0.414709 -1.610245
H  4.846407 -0.845317 -2.037473
N  4.340238 0.555578 -0.543408
H  4.914212 1.302954 -0.929058
H  4.841259 0.102096 0.21579
C  3.278303 0.367906 -2.751249
O  2.471237 -0.094241 -3.494967
O  3.795287 1.607919 -2.839647
H  3.385596 2.060882 -3.589553
H  3.383629 0.96685 -0.212742
totalener: -1406.23363011 hartree
nucrepener: 1833.33749811 hartree
electener: -3239.57112822 hartree
oneelecener: -5551.50499560 hartree
twoeener: 2311.93386738 hartree
kineticenergy: 1400.62968202 hartree
exchangeener: -105.316496339768 hartree
correlationener: -7.052011326330 hartree
xcener: -112.368507666098 hartree
temp: 298.15 k
press: 1.00 atm
thermalcorrenthalpy: 0.00094421 hartree
totalenthalpy: -1405.98483040 hartree
totalentropycorr: -0.06640004 hartree
gibbsenthalpy: -1406.05123043 hartree
gibbsminuselec: 0.26117257 hartree
chargesum: 1.0000000
charge: -0.205663 0.179379 -0.069881 0.131138 0.291200 -0.277321 0.211472 0.018676 -0.342291 -0.118324 0.144348 -0.191317 0.184376 0.147187 0.108292 -0.282695 0.234062 0.134102 -0.141277 0.121718 0.298898 -0.405021 -0.209631 0.138708 0.103313 -0.205181 0.151338 0.136824 -0.031544 0.153011 -0.075287 0.226916 0.210973 0.268277 -0.228525 -0.291124 0.252496 0.228380
charge: 0.326044 -0.020436 -0.036607 0.042233 -0.434775 0.139505 -0.404817 -0.142872 0.116362 0.368850 0.031464 -0.229815 -0.006037 0.015545 0.005641 0.348248 -0.083269 0.039287 0.488671 -0.139539 -0.323184 0.145215 0.000389 0.033952 0.036295 0.010514 0.042604 0.031798 -0.053045 0.045999 0.586331 0.031708 0.030713 -0.439475 0.179304 0.360296 -0.070493 -0.072603
qa: -0.2057 0.1794 -0.0699 0.1311 0.2912 -0.2773 0.2115 0.0187 -0.3423 -0.1183 0.1443 -0.1913 0.1844 0.1472 0.1083 -0.2827 0.2341 0.1341 -0.1413 0.1217 0.2989 -0.4050 -0.2096 0.1387 0.1033 -0.2052 0.1513 0.1368 -0.0315 0.1530 -0.0753 0.2269 0.2110 0.2683 -0.2285 -0.2911 0.2525 0.2284
va: 3.1683 1.0134 3.8228 1.0226 4.3037 2.2340 4.2116 3.7228 2.1670 3.2569 0.9980 4.0231 1.0404 0.9992 1.0217 2.1620 1.0212 0.9996 2.1680 1.0200 4.1634 2.1200 3.9069 1.0039 1.0283 3.8296 1.0313 0.9974 3.8706 1.0019 3.5193 0.9920 0.9857 4.3896 2.2650 2.1938 1.0107 1.1014
dispcorr: -0.079858597 hartree
energy: -1406.318400720134
dipole: 8.11206 -4.94685 3.16521 -1.49818 2.53455 1.03638 6.60602 -4.57229 2.03373
magnitude: 3.90239 au
magnitude: 9.91909 debye
zeropoint: 0.30957143 hartree
thermalvibcorrection: 0.01867248 hartree
thermalrotcorrection: 0.00141627 hartree
thermaltrasncorrection: 0.00141627 hartree
thermaltotal: -1405.98732426 hartree
thermalcorr: 0.02150503 hartree
nonthermalcorr: 0.30957143 hartree
totalcorr: 0.33107646 hartree
totalenthalpy: -1405.98638005 hartree
