program: Orca
programVersion: 5.0.2
elementType: N H C H C O C C O N H C H H H O H H S H C O C H H C H H C H N H H C O O H H
charge: 1
multiplicity: 1
keywords: wB97X-D3BJ Opt Freq def2-TZVPP def2/J RIJCOSX VeryTightSCF
keywords: PAL8 defgrid3 TightOpt
frequency: 0.00 0.00 0.00 0.00 0.00 0.00 7.93 19.87 37.52 54.71 61.13 76.03 80.22 85.36 105.64 117.57 130.88 155.88 210.22 231.10 248.59 253.37 284.12 302.10 310.46 322.96 335.36 358.90 373.67 449.89 459.55 485.04 499.68 505.10 525.33 533.34 550.48 557.08 577.00 615.42 632.30 660.60 666.33 683.75 736.80 745.85 778.56 801.23 817.67 833.93 872.67 887.30 894.57 899.14 959.78 986.78 1034.05 1055.38 1064.38 1092.91 1116.24 1133.72 1152.41 1167.45 1170.71 1195.08 1197.54 1219.50 1246.05 1272.63 1276.30 1292.95 1324.04 1332.11 1341.41 1352.14 1359.46 1367.51 1387.25 1405.27 1431.28 1449.40 1459.69 1461.56 1479.48 1498.52 1500.47 1504.85 1541.22 1588.06 1618.20 1704.76 1717.88 1788.45 1849.02 1887.15 2472.35 2715.25 3071.51 3085.18 3100.68 3114.78 3115.37 3132.58 3155.54 3166.12 3176.61 3191.59 3503.48 3574.24 3614.78 3685.98 3799.33 3801.42
frequency: 7.93 19.87 37.52 54.71 61.13 76.03 80.22 85.36 105.64 117.57 130.88 155.88 210.22 231.10 248.59 253.37 284.12 302.10 310.46 322.96 335.36 358.90 373.67 449.89 459.55 485.04 499.68 505.10 525.33 533.34 550.48 557.08 577.00 615.42 632.30 660.60 666.33 683.75 736.80 745.85 778.56 801.23 817.67 833.93 872.67 887.30 894.57 899.14 959.78 986.78 1034.05 1055.38 1064.38 1092.91 1116.24 1133.72 1152.41 1167.45 1170.71 1195.08 1197.54 1219.50 1246.05 1272.63 1276.30 1292.95 1324.04 1332.11 1341.41 1352.14 1359.46 1367.51 1387.25 1405.27 1431.28 1449.40 1459.69 1461.56 1479.48 1498.52 1500.47 1504.85 1541.22 1588.06 1618.20 1704.76 1717.88 1788.45 1849.02 1887.15 2472.35 2715.25 3071.51 3085.18 3100.68 3114.78 3115.37 3132.58 3155.54 3166.12 3176.61 3191.59 3503.48 3574.24 3614.78 3685.98 3799.33 3801.42
formula: C10H18N3O6S
InChI: InChI=1S/C10H18N3O6S/c11-5(10(18)19)1-2-7(14)13-6(4-20)9(17)12-3-8(15)16/h5-6,12-13,15,18,20H,1-4H2,11H3
38 atoms
N  -1.725332 -1.04971 -2.451886
H  -2.477107 -0.479322 -2.106789
C  -1.85042 -1.563287 -3.793324
H  -2.053001 -0.754653 -4.497072
C  -2.965598 -2.590489 -3.889378
O  -3.69541 -2.891959 -2.981892
C  -0.912416 -1.658506 -1.557832
C  -0.942949 -1.120789 -0.116819
O  -0.122267 -2.534862 -1.856827
N  -0.014719 0.009635 -0.011467
H  -0.586779 -1.937885 0.506833
C  -2.315555 -0.703739 0.399728
H  -0.408101 0.94041 -0.031098
H  -2.207132 -0.347089 1.425264
H  -2.733894 0.128282 -0.1736
O  -3.042317 -3.105034 -5.119372
H  -3.768055 -3.743829 -5.135512
H  -0.911546 -2.032301 -4.082758
S  -3.472061 -2.08609 0.491833
H  -3.578474 -2.32621 -0.824188
C  1.316742 -0.019102 -0.014441
O  1.960982 1.050719 0.007338
C  2.075562 -1.327022 -0.028444
H  2.761857 -1.273302 0.821304
H  1.42777 -2.184963 0.124425
C  2.850445 -1.578132 -1.338186
H  2.156883 -1.953682 -2.089254
H  3.578125 -2.369504 -1.148899
C  3.568906 -0.382427 -1.955528
H  4.319498 -0.73202 -2.668293
N  4.265313 0.446556 -0.91649
H  3.449843 0.822931 -0.30809
H  4.917834 -0.108039 -0.367893
C  2.629368 0.540378 -2.738397
O  1.548463 0.224028 -3.135673
O  3.216869 1.727384 -2.959223
H  2.616852 2.286791 -3.471577
H  4.76056 1.228883 -1.340856
totalener: -1406.24285870 hartree
nucrepener: 1881.23810634 hartree
electener: -3287.48096504 hartree
oneelecener: -5647.10133898 hartree
twoeener: 2359.62037394 hartree
kineticenergy: 1401.48873112 hartree
exchangeener: -105.472351240103 hartree
correlationener: -7.065132986968 hartree
xcener: -112.537484227072 hartree
temp: 298.15 k
press: 1.00 atm
thermalcorrenthalpy: 0.00094421 hartree
totalenthalpy: -1405.99291912 hartree
totalentropycorr: -0.06751129 hartree
gibbsenthalpy: -1406.06043041 hartree
gibbsminuselec: 0.26405383 hartree
chargesum: 1.0000000
charge: -0.172187 0.175378 -0.092678 0.142040 0.319333 -0.330616 0.255936 -0.020435 -0.388401 -0.105564 0.136717 -0.190699 0.184378 0.135687 0.101665 -0.259078 0.243927 0.130942 -0.121366 0.133888 0.257426 -0.406162 -0.199643 0.142791 0.127360 -0.220580 0.152806 0.138229 -0.026734 0.161186 -0.075315 0.229010 0.217017 0.284469 -0.259712 -0.283349 0.252850 0.229483
charge: 0.336871 -0.026008 -0.037898 0.035930 -0.434377 0.114789 -0.386360 -0.134837 0.097766 0.369162 0.039564 -0.260164 0.001735 0.017890 -0.003729 0.378301 -0.078320 0.040873 0.508319 -0.152198 -0.331109 0.127689 0.004161 0.033802 0.034970 0.008929 0.042796 0.034209 -0.055323 0.047212 0.592183 -0.060701 0.036000 -0.437725 0.161944 0.368602 -0.069994 0.035046
qa: -0.1722 0.1754 -0.0927 0.1420 0.3193 -0.3306 0.2559 -0.0204 -0.3884 -0.1056 0.1367 -0.1907 0.1844 0.1357 0.1017 -0.2591 0.2439 0.1309 -0.1214 0.1339 0.2574 -0.4062 -0.1996 0.1428 0.1274 -0.2206 0.1528 0.1382 -0.0267 0.1612 -0.0753 0.2290 0.2170 0.2845 -0.2597 -0.2833 0.2528 0.2295
va: 3.1745 1.0178 3.8026 1.0032 4.2883 2.1366 4.1310 3.8580 2.1179 3.1976 1.0192 4.0241 1.0222 0.9989 0.9958 2.2314 1.0131 1.0342 2.1600 1.0463 4.1896 2.1073 3.8546 1.0075 1.0422 3.8345 1.0343 1.0014 3.8396 1.0004 3.5358 1.0950 0.9824 4.3702 2.2159 2.2103 1.0103 0.9890
dispcorr: -0.081638373 hartree
energy: -1406.324567889329
dipole: 12.06973 -7.56529 4.50444 2.75865 -0.61867 2.13998 3.13163 -3.15304 -0.02141
magnitude: 4.98698 au
magnitude: 12.67590 debye
zeropoint: 0.31049598 hartree
thermalvibcorrection: 0.01821434 hartree
thermalrotcorrection: 0.00141627 hartree
thermaltrasncorrection: 0.00141627 hartree
thermaltotal: -1405.99302503 hartree
thermalcorr: 0.02104688 hartree
nonthermalcorr: 0.31049598 hartree
totalcorr: 0.33154285 hartree
totalenthalpy: -1405.99208083 hartree
