program: Orca
programVersion: 5.0.2
elementType: N H C H C O C C O N H C H H H O H H S H C O C H H C H H C H N H H C O O H H
charge: 1
multiplicity: 1
keywords: wB97X-D3BJ Opt Freq def2-TZVPP def2/J RIJCOSX VeryTightSCF
keywords: PAL8 defgrid3 TightOpt
frequency: 0.00 0.00 0.00 0.00 0.00 0.00 25.27 33.70 44.33 47.59 53.09 72.99 81.30 86.38 117.78 134.22 167.67 182.32 193.45 196.77 206.17 221.29 253.22 272.31 302.52 306.26 342.50 356.93 369.39 389.12 426.76 447.15 485.29 500.30 507.52 524.19 553.17 558.23 580.01 622.82 644.30 655.77 678.68 713.10 723.47 741.69 763.04 810.60 822.74 837.13 852.53 886.29 912.78 924.46 946.97 1011.72 1016.42 1042.28 1056.06 1078.43 1114.82 1119.54 1125.44 1147.85 1185.05 1188.31 1194.79 1236.11 1252.54 1271.49 1283.76 1303.95 1312.17 1314.34 1339.35 1348.63 1363.55 1374.29 1375.21 1415.88 1429.49 1450.98 1455.18 1468.91 1472.15 1498.65 1509.30 1521.81 1544.35 1587.24 1651.07 1665.90 1744.83 1765.97 1840.10 1896.56 2759.68 3097.58 3102.05 3102.36 3106.99 3116.69 3118.36 3154.95 3167.11 3167.33 3171.27 3265.97 3277.45 3532.19 3577.19 3685.73 3802.57 3809.04
frequency: 25.27 33.70 44.33 47.59 53.09 72.99 81.30 86.38 117.78 134.22 167.67 182.32 193.45 196.77 206.17 221.29 253.22 272.31 302.52 306.26 342.50 356.93 369.39 389.12 426.76 447.15 485.29 500.30 507.52 524.19 553.17 558.23 580.01 622.82 644.30 655.77 678.68 713.10 723.47 741.69 763.04 810.60 822.74 837.13 852.53 886.29 912.78 924.46 946.97 1011.72 1016.42 1042.28 1056.06 1078.43 1114.82 1119.54 1125.44 1147.85 1185.05 1188.31 1194.79 1236.11 1252.54 1271.49 1283.76 1303.95 1312.17 1314.34 1339.35 1348.63 1363.55 1374.29 1375.21 1415.88 1429.49 1450.98 1455.18 1468.91 1472.15 1498.65 1509.30 1521.81 1544.35 1587.24 1651.07 1665.90 1744.83 1765.97 1840.10 1896.56 2759.68 3097.58 3102.05 3102.36 3106.99 3116.69 3118.36 3154.95 3167.11 3167.33 3171.27 3265.97 3277.45 3532.19 3577.19 3685.73 3802.57 3809.04
formula: C10H18N3O6S
InChI: InChI=1S/C10H18N3O6S/c11-5(10(18)19)1-2-7(14)13-6(4-20)9(17)12-3-8(15)16/h5-6,12-13,15,18,20H,1-4H2,11H3
38 atoms
N  -1.38252 -1.944357 -2.71688
H  -1.7804 -2.715838 -2.210593
C  -1.43149 -1.960138 -4.160523
H  -2.091901 -2.759457 -4.493827
C  -0.070555 -2.145163 -4.812106
O  0.994509 -2.1302 -4.246968
C  -0.801726 -0.930716 -2.051219
C  -0.830179 -1.004249 -0.510778
O  -0.258653 -0.00084 -2.63345
N  -0.014923 0.062498 0.02293
H  -0.410748 -1.966897 -0.209185
C  -2.259665 -0.919547 0.038963
H  -0.404618 0.983468 -0.1408
H  -2.862286 -1.736165 -0.358634
H  -2.236614 -1.032041 1.121076
O  -0.215234 -2.307204 -6.126675
H  0.657281 -2.415779 -6.527941
H  -1.840447 -1.019163 -4.536059
S  -3.119031 0.611922 -0.402326
H  -2.752605 1.323351 0.669183
C  1.343049 0.069144 -0.035763
O  1.963314 1.122706 -0.149149
C  2.09824 -1.244117 0.024739
H  3.010681 -1.031214 0.583219
H  1.543439 -2.001456 0.578401
C  2.458343 -1.80474 -1.358674
H  1.576339 -2.113813 -1.920318
H  3.059769 -2.703075 -1.221546
C  3.289792 -0.876978 -2.240858
H  4.133574 -0.473933 -1.673169
N  2.511351 0.310224 -2.724407
H  1.551183 0.047983 -3.003955
H  2.40669 0.974896 -1.940706
C  3.895109 -1.634999 -3.421477
O  4.243877 -2.773845 -3.367094
O  4.054917 -0.833909 -4.492654
H  4.500933 -1.339064 -5.185999
H  2.982737 0.748949 -3.513538
totalener: -1406.24943818 hartree
nucrepener: 1903.74187411 hartree
electener: -3309.99131229 hartree
oneelecener: -5691.13212678 hartree
twoeener: 2381.14081449 hartree
kineticenergy: 1400.68124009 hartree
exchangeener: -105.330634337230 hartree
correlationener: -7.054701024471 hartree
xcener: -112.385335361701 hartree
temp: 298.15 k
press: 1.00 atm
thermalcorrenthalpy: 0.00094421 hartree
totalenthalpy: -1406.00144671 hartree
totalentropycorr: -0.06564815 hartree
gibbsenthalpy: -1406.06709486 hartree
gibbsminuselec: 0.26401964 hartree
chargesum: 1.0000000
charge: -0.176047 0.187064 -0.079504 0.148880 0.326363 -0.359807 0.242350 0.010001 -0.422031 -0.134731 0.122680 -0.154587 0.174470 0.108186 0.144264 -0.241007 0.240138 0.149408 -0.121281 0.115763 0.142467 -0.368357 -0.121616 0.136604 0.117055 -0.231184 0.098070 0.151038 -0.000210 0.150571 -0.051387 0.237551 0.239506 0.299494 -0.253255 -0.292704 0.245640 0.220147
charge: 0.344408 -0.015087 -0.030487 0.042688 -0.426540 0.102402 -0.382993 -0.151882 0.098049 0.335268 0.036259 -0.236403 -0.010873 0.007343 0.016333 0.391803 -0.078155 0.047779 0.508836 -0.145276 -0.369272 0.086426 -0.003798 0.045232 0.029843 0.000975 0.022174 0.046611 -0.045189 0.051894 0.612349 0.005647 0.011347 -0.432273 0.167506 0.358080 -0.073449 0.032424
qa: -0.1760 0.1871 -0.0795 0.1489 0.3264 -0.3598 0.2423 0.0100 -0.4220 -0.1347 0.1227 -0.1546 0.1745 0.1082 0.1443 -0.2410 0.2401 0.1494 -0.1213 0.1158 0.1425 -0.3684 -0.1216 0.1366 0.1171 -0.2312 0.0981 0.1510 -0.0002 0.1506 -0.0514 0.2376 0.2395 0.2995 -0.2533 -0.2927 0.2456 0.2201
va: 3.1913 1.0085 3.8066 1.0064 4.2439 2.1032 4.1504 3.9623 2.0816 3.1463 0.9982 3.9495 1.0500 1.0113 1.0072 2.2583 1.0177 1.0100 2.1782 1.0194 4.3143 2.1068 3.7887 1.0208 1.0122 3.8998 1.0403 1.0218 3.8381 1.0076 3.5725 1.0444 1.0300 4.3623 2.2513 2.1872 1.0159 0.9970
dispcorr: -0.083422616 hartree
energy: -1406.336727356278
dipole: 0.07339 0.18170 0.25510 -2.64879 1.88081 -0.76797 5.29970 -6.00492 -0.70522
magnitude: 1.07340 au
magnitude: 2.72838 debye
zeropoint: 0.31111691 hartree
thermalvibcorrection: 0.01842970 hartree
thermalrotcorrection: 0.00141627 hartree
thermaltrasncorrection: 0.00141627 hartree
thermaltotal: -1406.00434821 hartree
thermalcorr: 0.02126224 hartree
nonthermalcorr: 0.31111691 hartree
totalcorr: 0.33237915 hartree
totalenthalpy: -1406.00340400 hartree
