program: Orca
programVersion: 5.0.2
elementType: N H C H C O C C O N H C H H H O H H S H C O C H H C H H C H N H H C O O H H
charge: 1
multiplicity: 1
keywords: wB97X-D3BJ Opt Freq def2-TZVPP def2/J RIJCOSX VeryTightSCF
keywords: PAL8 defgrid3 TightOpt
frequency: 0.00 0.00 0.00 0.00 0.00 0.00 25.40 32.76 38.23 44.10 49.17 58.44 65.84 90.81 125.18 140.18 151.60 167.39 191.03 208.12 228.16 240.06 255.95 265.83 284.03 311.00 333.35 359.79 377.87 395.79 400.68 445.84 479.96 487.91 510.01 535.93 558.53 581.92 595.01 624.83 641.76 657.65 672.98 708.37 720.74 738.93 752.93 775.97 807.48 847.62 864.77 883.58 918.10 930.45 944.37 992.30 1024.80 1043.00 1064.84 1078.20 1107.78 1123.69 1147.30 1172.29 1193.60 1194.50 1215.19 1225.14 1251.78 1264.38 1288.09 1301.40 1317.84 1322.44 1341.13 1354.68 1370.46 1385.67 1401.13 1409.18 1429.93 1454.15 1463.02 1472.96 1475.66 1488.05 1493.28 1511.19 1518.15 1584.21 1620.72 1673.97 1733.46 1758.93 1852.45 1869.38 2763.23 3085.67 3102.52 3104.09 3107.93 3123.06 3124.35 3156.42 3161.37 3169.52 3185.55 3286.23 3379.35 3435.07 3636.83 3702.37 3785.90 3802.28
frequency: 25.40 32.76 38.23 44.10 49.17 58.44 65.84 90.81 125.18 140.18 151.60 167.39 191.03 208.12 228.16 240.06 255.95 265.83 284.03 311.00 333.35 359.79 377.87 395.79 400.68 445.84 479.96 487.91 510.01 535.93 558.53 581.92 595.01 624.83 641.76 657.65 672.98 708.37 720.74 738.93 752.93 775.97 807.48 847.62 864.77 883.58 918.10 930.45 944.37 992.30 1024.80 1043.00 1064.84 1078.20 1107.78 1123.69 1147.30 1172.29 1193.60 1194.50 1215.19 1225.14 1251.78 1264.38 1288.09 1301.40 1317.84 1322.44 1341.13 1354.68 1370.46 1385.67 1401.13 1409.18 1429.93 1454.15 1463.02 1472.96 1475.66 1488.05 1493.28 1511.19 1518.15 1584.21 1620.72 1673.97 1733.46 1758.93 1852.45 1869.38 2763.23 3085.67 3102.52 3104.09 3107.93 3123.06 3124.35 3156.42 3161.37 3169.52 3185.55 3286.23 3379.35 3435.07 3636.83 3702.37 3785.90 3802.28
formula: C10H18N3O6S
InChI: InChI=1S/C10H18N3O6S/c11-5(10(18)19)1-2-7(14)13-6(4-20)9(17)12-3-8(15)16/h5-6,12-13,15,18,20H,1-4H2,11H3
38 atoms
N  -1.024309 -2.722734 2.321025
H  -1.672153 -3.251109 1.765348
C  -0.514549 -3.291742 3.555086
H  -0.574488 -2.57284 4.369047
C  0.941128 -3.718672 3.420449
O  1.789531 -3.538882 4.247365
C  -0.443346 -1.617922 1.831891
C  -0.893326 -1.118813 0.443586
O  0.419896 -1.031368 2.480161
N  -0.034045 -0.03238 0.012883
H  -1.882957 -0.677514 0.584254
C  -1.051508 -2.230277 -0.604691
H  -0.433953 0.892865 0.051143
H  -0.117264 -2.762313 -0.775462
H  -1.780219 -2.96729 -0.264559
O  1.172196 -4.345634 2.246587
H  2.074833 -4.690507 2.274808
H  -1.109713 -4.168859 3.810333
S  -1.735872 -1.623839 -2.160024
H  -0.713724 -0.822746 -2.479135
C  1.322353 -0.004477 0.077805
O  1.916204 1.067154 0.1418
C  2.105182 -1.305951 -0.006719
H  1.57062 -2.1428 0.437758
H  2.2045 -1.526483 -1.07399
C  3.505687 -1.188733 0.596168
H  4.033161 -0.347196 0.142762
H  4.070389 -2.089588 0.357803
C  3.523377 -1.040989 2.118945
H  2.981566 -1.860349 2.595894
N  2.879372 0.232083 2.574381
H  2.809558 0.893333 1.784972
H  1.916105 0.036696 2.870459
C  4.931068 -1.029633 2.705754
O  5.317384 -0.158654 3.439885
O  5.634574 -2.090286 2.330452
H  6.505979 -2.052752 2.750937
H  3.448989 0.628342 3.329835
totalener: -1406.24481003 hartree
nucrepener: 1880.41576143 hartree
electener: -3286.66057145 hartree
oneelecener: -5643.44380286 hartree
twoeener: 2356.78323140 hartree
kineticenergy: 1400.66911000 hartree
exchangeener: -105.328217235688 hartree
correlationener: -7.055384285725 hartree
xcener: -112.383601521413 hartree
temp: 298.15 k
press: 1.00 atm
thermalcorrenthalpy: 0.00094421 hartree
totalenthalpy: -1405.99632026 hartree
totalentropycorr: -0.06557348 hartree
gibbsenthalpy: -1406.06189374 hartree
gibbsminuselec: 0.26431282 hartree
chargesum: 1.0000000
charge: -0.178782 0.192680 -0.066806 0.142389 0.289784 -0.284924 0.292001 0.031002 -0.467016 -0.189581 0.148856 -0.176796 0.195197 0.125778 0.109937 -0.277649 0.235532 0.136921 -0.106715 0.105681 0.182346 -0.371494 -0.124765 0.063535 0.146126 -0.239321 0.142027 0.131383 0.064617 0.086674 -0.047788 0.231654 0.243417 0.304832 -0.298735 -0.252312 0.254306 0.226007
charge: 0.351041 -0.018511 -0.023487 0.041858 -0.444770 0.131118 -0.358109 -0.140970 0.089323 0.338371 0.048582 -0.252599 -0.004829 0.001208 0.006914 0.353010 -0.087294 0.041653 0.506224 -0.149924 -0.370718 0.086453 -0.007238 0.020474 0.046460 0.002480 0.038886 0.039925 -0.046456 0.042229 0.618680 0.015495 0.007023 -0.427331 0.141003 0.398165 -0.063750 0.029413
qa: -0.1788 0.1927 -0.0668 0.1424 0.2898 -0.2849 0.2920 0.0310 -0.4670 -0.1896 0.1489 -0.1768 0.1952 0.1258 0.1099 -0.2776 0.2355 0.1369 -0.1067 0.1057 0.1823 -0.3715 -0.1248 0.0635 0.1461 -0.2393 0.1420 0.1314 0.0646 0.0867 -0.0478 0.2317 0.2434 0.3048 -0.2987 -0.2523 0.2543 0.2260
va: 3.2663 1.0091 3.8162 1.0198 4.2441 2.2155 4.1096 3.8777 2.0126 3.1359 1.0027 4.0158 1.0112 0.9909 1.0085 2.1823 1.0206 0.9988 2.1781 1.0313 4.2992 2.1127 3.7750 1.0342 1.0018 3.9358 1.0106 1.0192 3.8464 1.0702 3.5975 1.0323 1.0127 4.3476 2.1950 2.2592 1.0060 1.0104
dispcorr: -0.082951060 hartree
energy: -1406.333236654511
dipole: -0.62158 0.73318 0.11160 -1.50834 0.80020 -0.70814 -2.21920 2.64974 0.43055
magnitude: 0.83624 au
magnitude: 2.12554 debye
zeropoint: 0.31126255 hartree
thermalvibcorrection: 0.01849446 hartree
thermalrotcorrection: 0.00141627 hartree
thermaltrasncorrection: 0.00141627 hartree
thermaltotal: -1406.00064710 hartree
thermalcorr: 0.02132700 hartree
nonthermalcorr: 0.31126255 hartree
totalcorr: 0.33258955 hartree
totalenthalpy: -1405.99970289 hartree
