program: Gaussian 09
title: 000048469
version: EM64L-G09RevD.01
frameworkgroup: C1[X(C11H14N2O3)]
method: RPBEPBE
basis: SDD
operation: Freq
keyword: #p
keyword: freq=noraman
keyword: PBEPBE/SDD
title: #p freq=noraman PBEPBE/SDD
converged: NO YES NO NO
title: Mulliken charges:
elementType: O O O N N C C C C C C C C C C C H H H H H H H H H H H H H H
charge: -0.193070 -0.215861 -0.217182 -0.379007 -0.381272 0.084566 0.129048 -0.424116 0.144412 0.135537 -0.742502 -0.733070 -0.723459 0.254715 0.152840 -0.528307 0.241130 0.252988 0.234191 0.239924 0.241996 0.263360 0.238275 0.221961 0.225986 0.238268 0.225581 0.363834 0.363942 0.285289
chargesum: 0.00000
title: Mulliken charges with hydrogens summed into heavy atoms:
elementType: O O O N N C C C C C C C C C C C
charge: -0.193070 -0.215861 -0.217182 -0.015173 -0.017330 0.084566 0.129048 0.070003 0.144412 0.135537 -0.026391 -0.009474 -0.033624 0.254715 0.152840 -0.243018
polarizability: 1.62581222e+02 -1.72281524e-01 1.27005899e+02 1.32751386e+01 -1.11551796e+01 1.21457610e+02
1716.lowfreq: -12.2209 -3.8640 -0.0008 -0.0007 -0.0004 11.0159 38.1247 52.4290 100.5603
frequency: 37.2577 52.2389 100.5542 121.4579 145.0231 150.2408 158.7724 171.6162 186.8355 213.5523 222.7217 235.7125 249.0290 303.6409 310.2280 339.1823 350.7720 367.9663 372.3707 386.9466 446.4515 484.0982 526.7702 541.2791 585.7984 620.1874 632.4579 638.3218 651.1044 653.2393 687.8010 708.3420 750.4355 773.6511 782.5064 799.1524 894.4268 919.9594 935.2682 954.7110 967.3018 996.6366 1019.8031 1076.3102 1105.7767 1137.0622 1147.0056 1162.7860 1199.8686 1223.9643 1290.9331 1304.8342 1336.6137 1367.1558 1374.8710 1375.5909 1389.7364 1392.3465 1410.2216 1448.9313 1462.5399 1471.5477 1479.1235 1481.4275 1487.8768 1495.7522 1609.4761 1646.6703 1676.9766 2132.4306 2984.6696 2994.3777 3005.0467 3027.6239 3073.3419 3083.2519 3092.1654 3097.4902 3101.3138 3104.8768 3118.6442 3427.1427 3516.7579 3518.5693
redmass: 4.3834 5.7864 2.4674 4.0533 3.1313 5.6735 6.5861 4.0644 2.5581 3.8008 1.4984 1.2786 1.1512 2.0357 3.0629 2.8318 7.6580 7.2782 5.5211 2.7273 4.7093 9.2505 5.6575 5.1713 4.9467 5.3847 3.8724 1.2360 1.8892 1.4949 3.2266 4.9974 1.6561 1.4512 1.6341 2.8185 5.5068 2.3375 1.5505 2.1838 2.0737 3.3295 1.2798 3.1140 2.9249 2.1617 2.0490 3.6736 4.4884 2.9449 3.3371 1.2943 1.4215 9.0464 2.1572 1.4427 1.1853 1.2033 1.1834 1.0793 1.0543 1.0490 1.0476 1.0511 1.0435 1.0514 6.7224 8.6152 5.4899 6.0412 1.0361 1.0356 1.0353 1.0600 1.0992 1.0990 1.0999 1.1005 1.1001 1.1023 1.1008 1.1590 1.0758 1.0780
irintensity: 0.0572 0.7582 0.2530 0.6556 2.2787 0.8382 10.0307 0.4793 0.3887 0.3694 0.6347 0.6125 0.5978 2.6976 2.9190 0.5127 17.7623 9.5543 6.6450 3.5949 16.5290 12.5355 9.2745 2.1662 1.4212 12.2485 4.9431 69.3552 14.2307 53.2200 19.0092 10.7479 2.0868 5.5845 207.8739 7.0793 21.2324 0.3857 0.5588 6.2925 4.3673 5.4670 2.9342 6.2791 8.9344 25.1899 62.4496 2.4635 47.3384 13.9846 284.6873 32.8830 29.7572 232.0487 3.4713 3.6857 16.2499 14.3953 20.2099 17.8491 0.3480 6.1518 7.8814 13.0654 16.9245 11.7727 265.9737 80.5224 609.1483 0.1643 26.5493 15.3741 15.4951 8.8750 13.7306 25.7953 17.4530 5.8354 30.6167 18.1903 12.8270 64.7102 85.7173 45.2862
temp: 298.150 k
press: 1.00000 atm
elementType: 8 8 8 7 7 6 6 6 6 6 6 6 6 6 6 6 1 1 1 1 1 1 1 1 1 1 1 1 1 1
symmnumber: 1
zpe: 617745.1 jmol-1
zpe.correction: 0.235287 hartree
zpe.thermalcorrener: 0.251891 hartree
zpe.thermalcorrenthalpy: 0.252835 hartree
zpe.thermalcorrgfe: 0.192346 hartree
zpe.sumelectzpe: -761.526328 hartree
zpe.sumelectthermal: -761.509724 hartree
zpe.sumelectthermalent: -761.508780 hartree
zpe.sumelectthermalfe: -761.569269 hartree
dipole: 1.2534 -0.1002 -0.7832
dipole: 1.4813
quadrupole: -99.6414 -97.8293 -95.9445
quadrupole: -4.1009 -2.0916 3.7020
quadrupole: -1.8363 -0.0242 1.8605 -4.1009 -2.0916 3.7020
hfenergy: -761.7616147 hartree
pointgroup: C01 [X(C11H14N2O3)]
dipole: -0.4402292 0.0320517 -0.3805616 debye
polarizability: 165.5176649|-2.8442781|127.9976617|-6.2249544|10.727478|117.5294053 unknown
InChI: InChI=1S/C11H14N2O3/c1-5-10(3,4)11(6-2)7(14)12-9(16)13-8(11)15/h1,12-13H,6H2,2-4H3
charge 0 multiplicity 1
30 atoms
O  -0.62931 1.104504 2.035131
O  0.798374 -2.242743 -1.137688
O  3.651517 1.135561 0.257199
N  1.441854 1.168843 1.027196
N  2.154114 -0.509714 -0.462924
C  -0.295482 -0.433295 0.135051
C  -1.16593 0.296305 -1.0494
C  -1.165911 -1.492373 0.881778
C  0.131582 0.651845 1.145405
C  0.898904 -1.144302 -0.529333
C  -0.270122 1.275963 -1.870158
C  -1.777597 -0.75853 -2.023823
C  -0.448277 -2.1727 2.066978
C  -2.279571 1.063176 -0.446361
C  2.496041 0.643643 0.265598
C  -3.238869 1.71862 -0.036365
H  -1.459202 -2.26383 0.150901
H  -2.0765 -0.979671 1.237625
H  0.529224 0.729434 -2.401629
H  -0.891338 1.784817 -2.626139
H  0.186098 2.054663 -1.235721
H  -1.00194 -1.427341 -2.430159
H  -2.549514 -1.370653 -1.531298
H  -2.259948 -0.220409 -2.858443
H  0.461218 -2.709464 1.73945
H  -0.172741 -1.446035 2.851406
H  -1.119224 -2.918026 2.529773
H  1.684193 1.94991 1.646014
H  2.926359 -0.964412 -0.961702
H  -4.056001 2.291714 0.361539
