program: Orca
programVersion: 5.0.2
elementType: N H C H C O C C O N H C H H H O H H S H C O C H H C H H C H N H H C O O H H
charge: 1
multiplicity: 1
keywords: wB97X-D3BJ Opt Freq def2-TZVPP def2/J RIJCOSX VeryTightSCF
keywords: PAL8 defgrid3 TightOpt
frequency: 0.00 0.00 0.00 0.00 0.00 0.00 26.41 33.95 47.52 62.63 74.13 77.30 95.89 99.12 110.16 136.22 162.74 175.75 177.88 215.31 220.68 232.59 242.26 274.22 284.25 302.20 322.43 333.84 340.13 384.46 388.85 456.91 505.61 516.83 555.19 557.97 584.22 595.18 611.05 632.91 640.71 658.30 705.71 720.05 760.32 777.01 784.45 836.05 844.37 866.44 887.95 915.44 925.53 961.89 971.49 976.09 1010.82 1028.34 1057.06 1061.66 1106.13 1113.02 1119.74 1152.19 1168.06 1207.19 1216.37 1232.13 1252.77 1292.60 1309.62 1318.71 1325.16 1337.65 1357.13 1367.23 1381.98 1391.35 1398.39 1404.82 1435.24 1455.22 1484.44 1491.10 1497.42 1501.02 1512.95 1516.06 1542.96 1601.87 1650.00 1670.18 1714.70 1800.17 1854.58 1895.31 2764.14 3033.11 3081.92 3096.61 3102.02 3104.01 3115.96 3143.51 3153.38 3159.17 3178.33 3195.03 3273.54 3495.34 3549.94 3555.84 3641.17 3783.13
frequency: 26.41 33.95 47.52 62.63 74.13 77.30 95.89 99.12 110.16 136.22 162.74 175.75 177.88 215.31 220.68 232.59 242.26 274.22 284.25 302.20 322.43 333.84 340.13 384.46 388.85 456.91 505.61 516.83 555.19 557.97 584.22 595.18 611.05 632.91 640.71 658.30 705.71 720.05 760.32 777.01 784.45 836.05 844.37 866.44 887.95 915.44 925.53 961.89 971.49 976.09 1010.82 1028.34 1057.06 1061.66 1106.13 1113.02 1119.74 1152.19 1168.06 1207.19 1216.37 1232.13 1252.77 1292.60 1309.62 1318.71 1325.16 1337.65 1357.13 1367.23 1381.98 1391.35 1398.39 1404.82 1435.24 1455.22 1484.44 1491.10 1497.42 1501.02 1512.95 1516.06 1542.96 1601.87 1650.00 1670.18 1714.70 1800.17 1854.58 1895.31 2764.14 3033.11 3081.92 3096.61 3102.02 3104.01 3115.96 3143.51 3153.38 3159.17 3178.33 3195.03 3273.54 3495.34 3549.94 3555.84 3641.17 3783.13
formula: C10H18N3O6S
InChI: InChI=1S/C10H18N3O6S/c11-5(10(18)19)1-2-7(14)13-6(4-20)9(17)12-3-8(15)16/h5-6,12-13,15,18,20H,1-4H2,11H3
38 atoms
N  -0.623174 -3.363927 1.0263
H  -0.621677 -3.68988 0.068312
C  -0.403438 -4.332652 2.093868
H  -1.109904 -4.147801 2.905805
C  1.02429 -4.259279 2.635351
O  1.878685 -5.079835 2.423339
C  -0.63573 -2.040798 1.258038
C  -0.975942 -1.09158 0.10125
O  -0.417264 -1.569082 2.375648
N  -0.005087 -0.020181 -0.021299
H  -1.883859 -0.609821 0.477839
C  -1.397501 -1.723423 -1.230677
H  -0.374516 0.917096 0.020373
H  -2.253483 -2.377314 -1.059164
H  -1.713078 -0.913157 -1.885827
O  1.302471 -3.166084 3.362792
H  0.577305 -2.484756 3.227799
H  -0.563216 -5.331039 1.696483
S  -0.071058 -2.659499 -2.050921
H  -0.827451 -3.143231 -3.041592
C  1.361549 -0.024466 0.089763
O  1.972766 1.019139 0.174502
C  2.120018 -1.340772 0.090895
H  1.473811 -2.214794 0.119818
H  2.674028 -1.390924 -0.848264
C  3.082979 -1.367556 1.277416
H  2.514867 -1.212742 2.196879
H  3.789466 -0.540827 1.193952
C  3.815324 -2.7152 1.368196
H  3.191315 -3.523035 0.988069
N  4.082506 -3.063798 2.805388
H  4.73322 -2.40534 3.232823
H  3.177396 -3.057304 3.303949
C  5.096799 -2.702644 0.551396
O  5.098072 -2.587869 -0.635649
O  6.192341 -2.805754 1.326717
H  6.977905 -2.765868 0.761889
H  4.47566 -4.00114 2.890502
totalener: -1406.22267638 hartree
nucrepener: 1925.10241705 hartree
electener: -3331.32509342 hartree
oneelecener: -5732.99741987 hartree
twoeener: 2401.67232644 hartree
kineticenergy: 1400.63210081 hartree
exchangeener: -105.317440876368 hartree
correlationener: -7.057984357204 hartree
xcener: -112.375425233572 hartree
temp: 298.15 k
press: 1.00 atm
thermalcorrenthalpy: 0.00094421 hartree
totalenthalpy: -1405.97817237 hartree
totalentropycorr: -0.06499934 hartree
gibbsenthalpy: -1406.04317171 hartree
gibbsminuselec: 0.26378382 hartree
chargesum: 1.0000000
charge: -0.165439 0.189857 -0.121665 0.161502 0.318238 -0.324839 0.222707 -0.019465 -0.376166 -0.172894 0.136186 -0.162414 0.189381 0.135765 0.135884 -0.332991 0.257731 0.144340 -0.159109 0.134247 0.202527 -0.326606 -0.086003 0.011307 0.163288 -0.231346 0.105575 0.159079 -0.009077 0.160369 -0.057259 0.232831 0.244785 0.276555 -0.246007 -0.293048 0.258503 0.243671
charge: 0.339349 -0.047931 -0.023265 0.040319 -0.440456 0.115401 -0.358129 -0.143687 0.151029 0.332297 0.059173 -0.224979 -0.007205 0.007912 0.014056 0.355141 -0.171314 0.042733 0.505840 -0.136697 -0.376993 0.107897 -0.014569 0.001710 0.045423 0.002536 0.027296 0.041858 -0.047150 0.045242 0.611730 0.051212 0.009550 -0.435347 0.173150 0.355736 -0.065767 0.056895
qa: -0.1654 0.1899 -0.1217 0.1615 0.3182 -0.3248 0.2227 -0.0195 -0.3762 -0.1729 0.1362 -0.1624 0.1894 0.1358 0.1359 -0.3330 0.2577 0.1443 -0.1591 0.1342 0.2025 -0.3266 -0.0860 0.0113 0.1633 -0.2313 0.1056 0.1591 -0.0091 0.1604 -0.0573 0.2328 0.2448 0.2766 -0.2460 -0.2930 0.2585 0.2437
va: 3.1509 1.0598 3.8777 0.9933 4.1556 2.1639 4.1871 3.9728 2.1623 3.0802 0.9964 3.9407 1.0186 1.0013 1.0103 2.1314 1.0736 1.0085 2.1872 1.0157 4.3538 2.2031 3.7625 1.0609 1.0225 3.9271 1.0293 1.0237 3.6645 1.0172 3.6482 0.9815 1.0314 4.4212 2.2602 2.2028 1.0055 0.9767
dispcorr: -0.084873998 hartree
energy: -1406.312939881651
dipole: -3.63974 3.94716 0.30741 -1.60745 -0.09904 -1.70649 1.85064 -0.45870 1.39193
magnitude: 2.22353 au
magnitude: 5.65176 debye
zeropoint: 0.31148955 hartree
thermalvibcorrection: 0.01819047 hartree
thermalrotcorrection: 0.00141627 hartree
thermaltrasncorrection: 0.00141627 hartree
thermaltotal: -1405.98042732 hartree
thermalcorr: 0.02102302 hartree
nonthermalcorr: 0.31148955 hartree
totalcorr: 0.33251257 hartree
totalenthalpy: -1405.97948311 hartree
