program: Orca
programVersion: 5.0.2
elementType: N H C H C O C C O N H C H H H O H H S H C O C H H C H H C H N H H C O O H H
charge: 1
multiplicity: 1
keywords: wB97X-D3BJ Opt Freq def2-TZVPP def2/J RIJCOSX VeryTightSCF
keywords: PAL8 defgrid3 TightOpt
frequency: 0.00 0.00 0.00 0.00 0.00 0.00 22.03 37.94 49.09 54.38 63.26 77.72 97.83 99.72 112.85 124.60 145.95 162.28 171.07 182.19 196.20 222.98 259.26 289.16 303.63 306.97 318.42 332.38 373.51 392.17 419.93 459.85 474.24 490.40 503.55 509.93 547.08 556.54 570.80 581.84 604.62 623.85 640.66 673.15 696.65 721.58 742.96 772.80 810.76 819.23 868.09 890.14 891.81 910.24 944.73 977.67 1014.06 1027.31 1042.14 1069.87 1086.09 1091.39 1127.85 1134.65 1175.40 1200.27 1206.61 1249.28 1252.91 1264.97 1274.72 1290.11 1309.99 1330.18 1344.43 1352.96 1364.90 1373.43 1397.63 1412.92 1414.46 1427.43 1466.87 1467.03 1476.71 1484.95 1488.55 1511.30 1531.95 1561.55 1650.95 1667.97 1756.45 1798.97 1865.28 1899.54 2726.55 3061.87 3065.15 3093.00 3097.90 3123.81 3129.90 3148.57 3150.18 3158.71 3211.41 3433.70 3515.24 3539.83 3647.17 3701.94 3797.87 3849.69
frequency: 22.03 37.94 49.09 54.38 63.26 77.72 97.83 99.72 112.85 124.60 145.95 162.28 171.07 182.19 196.20 222.98 259.26 289.16 303.63 306.97 318.42 332.38 373.51 392.17 419.93 459.85 474.24 490.40 503.55 509.93 547.08 556.54 570.80 581.84 604.62 623.85 640.66 673.15 696.65 721.58 742.96 772.80 810.76 819.23 868.09 890.14 891.81 910.24 944.73 977.67 1014.06 1027.31 1042.14 1069.87 1086.09 1091.39 1127.85 1134.65 1175.40 1200.27 1206.61 1249.28 1252.91 1264.97 1274.72 1290.11 1309.99 1330.18 1344.43 1352.96 1364.90 1373.43 1397.63 1412.92 1414.46 1427.43 1466.87 1467.03 1476.71 1484.95 1488.55 1511.30 1531.95 1561.55 1650.95 1667.97 1756.45 1798.97 1865.28 1899.54 2726.55 3061.87 3065.15 3093.00 3097.90 3123.81 3129.90 3148.57 3150.18 3158.71 3211.41 3433.70 3515.24 3539.83 3647.17 3701.94 3797.87 3849.69
formula: C10H18N3O6S
InChI: InChI=1S/C10H18N3O6S/c11-5(10(18)19)1-2-7(14)13-6(4-20)9(17)12-3-8(15)16/h5-6,12-13,15,18,20H,1-4H2,11H3
38 atoms
N  -1.516952 -3.353728 0.516774
H  -1.993314 -3.465022 -0.359471
C  -1.177912 -4.537905 1.260969
H  -1.194243 -4.315697 2.32933
C  0.206037 -5.063128 0.870697
O  0.791453 -4.711771 -0.117069
C  -0.79603 -2.222175 0.759606
C  -1.041311 -1.04959 -0.200571
O  -0.057454 -2.133593 1.716673
N  -0.049604 -0.004794 -0.059462
H  -1.970698 -0.606437 0.174993
C  -1.348754 -1.428388 -1.661297
H  -0.404844 0.936282 0.002397
H  -2.323078 -1.916908 -1.721151
H  -1.440022 -0.502283 -2.229032
O  0.733942 -5.980274 1.688743
H  0.180364 -6.128092 2.462758
H  -1.914991 -5.3182 1.061848
S  -0.135001 -2.405116 -2.583572
H  -0.092333 -3.476453 -1.778814
C  1.305983 -0.029949 -0.045043
O  1.937028 1.018268 -0.01049
C  2.059771 -1.345709 -0.069729
H  1.490402 -2.158821 -0.505924
H  2.247005 -1.613961 0.970444
C  3.397863 -1.179102 -0.782115
H  3.964818 -2.108208 -0.661701
H  3.955869 -0.361755 -0.319731
C  3.262074 -0.908514 -2.282433
H  2.677334 -1.681536 -2.77907
N  4.660389 -0.930831 -2.873247
H  5.17833 -0.119392 -2.5253
H  5.150856 -1.781957 -2.597151
C  2.649657 0.45014 -2.628748
O  1.514474 0.606378 -2.954326
O  3.586599 1.413254 -2.554264
H  3.159613 2.277064 -2.640454
H  4.648657 -0.877091 -3.892378
totalener: -1406.20578269 hartree
nucrepener: 1923.27285337 hartree
electener: -3329.47863606 hartree
oneelecener: -5732.58837964 hartree
twoeener: 2403.10974358 hartree
kineticenergy: 1400.63962962 hartree
exchangeener: -105.315248335681 hartree
correlationener: -7.054203118802 hartree
xcener: -112.369451454483 hartree
temp: 298.15 k
press: 1.00 atm
thermalcorrenthalpy: 0.00094421 hartree
totalenthalpy: -1405.95972119 hartree
totalentropycorr: -0.06578434 hartree
gibbsenthalpy: -1406.02550553 hartree
gibbsminuselec: 0.26410040 hartree
chargesum: 1.0000000
charge: -0.198896 0.175510 -0.149492 0.129130 0.350255 -0.335638 0.217998 0.000442 -0.347785 -0.134856 0.132880 -0.161841 0.180217 0.117461 0.127963 -0.218016 0.221613 0.150289 -0.170977 0.128030 0.166370 -0.371687 -0.104037 0.053312 0.143654 -0.173501 0.104571 0.141725 0.004403 0.174597 -0.060226 0.243344 0.236702 0.247188 -0.232898 -0.291273 0.258377 0.245094
charge: 0.326934 -0.031108 -0.059069 0.034934 -0.433722 0.117150 -0.383234 -0.137442 0.119336 0.347609 0.051532 -0.249333 -0.008237 0.002065 0.018641 0.394495 -0.092766 0.036132 0.498922 -0.163425 -0.375879 0.069014 -0.005579 0.008883 0.047297 -0.006776 0.029482 0.035947 -0.037915 0.035445 0.614649 0.055524 0.056236 -0.451205 0.177074 0.363592 -0.064909 0.059707
qa: -0.1989 0.1755 -0.1495 0.1291 0.3503 -0.3356 0.2180 0.0004 -0.3478 -0.1349 0.1329 -0.1618 0.1802 0.1175 0.1280 -0.2180 0.2216 0.1503 -0.1710 0.1280 0.1664 -0.3717 -0.1040 0.0533 0.1437 -0.1735 0.1046 0.1417 0.0044 0.1746 -0.0602 0.2433 0.2367 0.2472 -0.2329 -0.2913 0.2584 0.2451
va: 3.1874 1.0172 3.8731 1.0128 4.2121 2.1318 4.2573 3.8931 2.1657 3.1231 0.9909 3.9505 1.0219 1.0004 1.0090 2.2614 1.0203 0.9928 2.1696 1.0414 4.3961 2.1400 3.7928 1.0844 1.0146 3.9755 1.0105 1.0160 3.7248 1.0305 3.6618 0.9869 0.9723 4.4178 2.2534 2.1900 1.0089 0.9674
dispcorr: -0.084268737 hartree
energy: -1406.295108691009
dipole: 3.70435 -1.12717 2.57718 -1.81656 1.63608 -0.18048 -1.67950 -0.43030 -2.10980
magnitude: 3.33552 au
magnitude: 8.47821 debye
zeropoint: 0.31077670 hartree
thermalvibcorrection: 0.01868990 hartree
thermalrotcorrection: 0.00141627 hartree
thermaltrasncorrection: 0.00141627 hartree
thermaltotal: -1405.96280955 hartree
thermalcorr: 0.02152244 hartree
nonthermalcorr: 0.31077670 hartree
totalcorr: 0.33229914 hartree
totalenthalpy: -1405.96186534 hartree
