program: Gaussian 09
title: 000048481
version: EM64L-G09RevD.01
frameworkgroup: C1[X(C11H18N2O4)]
method: RPBEPBE
basis: SDD
operation: Freq
keyword: #p
keyword: freq=noraman
keyword: PBEPBE/SDD
title: #p freq=noraman PBEPBE/SDD
converged: NO YES NO NO
title: Mulliken charges:
elementType: O O O O N N C C C C C C C C C C C H H H H H H H H H H H H H H H H H H
charge: -0.279870 -0.179504 -0.207104 -0.223606 -0.379899 -0.378721 0.071638 0.010920 -0.420639 0.172098 0.131537 -0.388581 -0.750944 -0.705674 0.140693 -0.210391 -0.674402 0.206989 0.218295 0.244320 0.230174 0.213804 0.246566 0.220251 0.264231 0.362573 0.364120 0.215564 0.211532 0.218617 0.186060 0.200477 0.203980 0.232027 0.232868
chargesum: 0.00000
title: Mulliken charges with hydrogens summed into heavy atoms:
elementType: O O O O N N C C C C C C C C C C C
charge: -0.279870 -0.179504 -0.207104 -0.223606 -0.017326 -0.014601 0.071638 0.217909 0.041977 0.172098 0.131537 0.055397 -0.019896 -0.059961 0.140693 0.176146 -0.005527
polarizability: 1.41040978e+02 -2.84774560e+00 1.60498096e+02 -1.00421752e+01 -2.42980078e+00 1.32931960e+02
1716.lowfreq: -4.1111 -0.0003 0.0000 0.0005 7.2257 11.5352 30.6851 44.6405 52.7419
frequency: 30.4132 44.5572 52.7368 63.3148 73.4827 99.5437 116.2654 131.2014 149.2293 157.5370 191.4964 199.1120 218.7378 236.0308 240.8626 270.7322 281.0366 296.5509 307.6306 358.5361 366.2382 380.3460 459.8279 488.0153 503.2459 541.6239 610.5821 623.0646 643.4895 674.9789 695.1312 737.2102 742.5763 755.2451 775.7281 802.8076 816.5729 842.3758 891.2261 922.4608 940.1070 964.6086 991.1157 1017.9844 1041.9667 1063.4877 1076.8572 1099.9000 1112.2729 1125.8574 1134.6038 1144.2375 1152.3885 1183.0262 1249.9718 1264.5817 1291.5492 1302.9921 1317.2031 1317.2715 1326.3423 1359.1572 1361.9001 1372.7657 1374.2546 1375.0222 1391.0793 1395.1645 1397.8341 1451.9217 1458.4208 1469.2423 1474.4525 1478.0385 1479.1922 1481.7917 1485.2760 1491.9651 1621.8450 1663.1281 1672.8821 2912.9984 2929.9206 2975.0206 2988.3944 2988.7924 2996.1841 2998.2735 3020.4330 3039.4332 3071.3659 3075.5650 3087.9552 3090.5453 3094.1295 3105.2570 3106.1406 3520.8643 3523.1349
redmass: 3.3938 2.7077 3.3130 2.4206 2.7294 2.8742 2.7093 4.0843 6.9268 9.7026 3.3394 4.9641 1.1045 1.1956 1.2416 4.2799 2.5788 3.2316 2.9735 10.8129 9.8392 3.7062 3.9484 8.3426 4.4039 4.2612 6.1200 3.9145 2.5843 2.2709 5.3678 1.2972 1.6563 4.2586 1.7324 2.6776 1.0959 1.5075 2.4059 2.2670 2.8060 1.9759 3.4783 2.1336 2.8054 2.5374 3.7971 2.0263 2.2582 2.4399 1.5512 2.9969 3.0858 3.8264 1.1552 1.2991 2.2522 1.7486 1.1648 1.1745 1.3145 5.2146 1.5838 1.8517 1.4485 1.4103 1.2089 1.2370 1.2413 1.0787 1.0405 1.0491 1.0586 1.0532 1.0421 1.0484 1.0732 1.0760 7.3622 9.0919 5.5488 1.0829 1.0577 1.0354 1.0983 1.0600 1.0361 1.0411 1.0593 1.0991 1.1012 1.0990 1.1013 1.1017 1.0991 1.1011 1.1000 1.0761 1.0779
irintensity: 0.1499 1.8666 1.2895 0.0730 0.3178 1.8909 0.6026 0.7354 2.0104 9.3509 0.1364 1.8816 0.0213 0.6007 0.4572 3.8774 2.7227 1.4949 0.9563 23.1848 2.0851 10.2103 23.0494 10.3267 11.8360 9.2037 3.5684 6.5435 4.1079 35.5074 1.0615 0.7287 14.8961 2.6387 196.7359 8.9820 3.8860 0.1727 1.1625 23.0257 39.9936 5.0737 9.4782 24.2633 35.1506 3.9292 106.7249 40.4469 16.5769 7.2398 33.6026 29.9625 46.3207 22.1882 0.6655 10.7266 146.5642 140.4974 15.7573 19.9203 11.9091 199.7622 29.5037 0.5330 8.2710 9.8091 10.4644 17.7498 34.4841 18.0639 9.9881 11.4878 0.8485 5.0000 12.4528 16.3556 12.0719 7.4321 270.6164 120.4363 594.1997 38.7911 63.7097 39.2360 30.9226 19.5447 21.5397 26.8585 18.3219 0.4093 28.0624 47.6017 19.9663 26.2059 32.8527 28.9177 15.2740 81.5991 43.3708
temp: 298.150 k
press: 1.00000 atm
elementType: 8 8 8 8 7 7 6 6 6 6 6 6 6 6 6 6 6 1 1 1 1 1 1 1 1 1 1 1 1 1 1 1 1 1 1
symmnumber: 1
zpe: 751792.1 jmol-1
zpe.correction: 0.286342 hartree
zpe.thermalcorrener: 0.305031 hartree
zpe.thermalcorrenthalpy: 0.305975 hartree
zpe.thermalcorrgfe: 0.238920 hartree
zpe.sumelectzpe: -839.077070 hartree
zpe.sumelectthermal: -839.058381 hartree
zpe.sumelectthermalent: -839.057437 hartree
zpe.sumelectthermalfe: -839.124493 hartree
dipole: 2.4535 -0.0061 1.7349
dipole: 3.0050
quadrupole: -96.0866 -112.3219 -105.8298
quadrupole: 2.2201 6.0534 0.0773
quadrupole: 8.6595 -7.5758 -1.0837 2.2201 6.0534 0.0773
hfenergy: -839.3634125 hartree
pointgroup: C01 [X(C11H18N2O4)]
dipole: -0.8724073 0.465585 -0.6479496 debye
polarizability: 147.1995871|10.0223914|153.5505662|-7.8330964|7.1568082|133.7208807 unknown
InChI: InChI=1S/C11H18N2O4/c1-4-6-11(7(3)17-5-2)8(14)12-10(16)13-9(11)15/h7,12-13H,4-6H2,1-3H3
charge 0 multiplicity 1
35 atoms
O  -2.177728 0.485085 -0.018865
O  -0.353635 -0.235491 2.24416
O  1.700261 -0.985832 -1.973073
O  2.660414 2.826752 0.505856
N  0.982918 1.386905 1.278191
N  2.101134 0.935723 -0.751925
C  0.07274 -0.415834 -0.19677
C  -1.042242 0.457397 -0.944654
C  -0.332585 -1.907534 -0.106661
C  0.202811 0.202319 1.213314
C  1.353809 -0.226776 -1.032399
C  0.687193 -2.810063 0.626485
C  -1.431876 -0.090043 -2.32933
C  0.220599 -4.281668 0.64739
C  1.951529 1.800902 0.35189
C  -3.197961 1.503241 -0.336504
C  -4.174439 1.536977 0.838331
H  -0.641216 1.492958 -1.052584
H  -0.463183 -2.291703 -1.134056
H  -1.309904 -1.952984 0.40612
H  0.820335 -2.455926 1.665511
H  1.670616 -2.748146 0.120627
H  -2.034466 -1.007425 -2.222747
H  -2.034209 0.656123 -2.877252
H  -0.543304 -0.324603 -2.940188
H  0.953372 1.914093 2.156913
H  2.884132 1.150105 -1.378216
H  -0.752538 -4.380798 1.163895
H  0.10185 -4.676692 -0.379267
H  0.949126 -4.924683 1.173895
H  -2.703076 2.489999 -0.478449
H  -3.721069 1.237289 -1.278816
H  -4.969695 2.282751 0.656067
H  -4.644871 0.548343 0.975625
H  -3.648444 1.798837 1.771986
