program: Orca
programVersion: 5.0.2
elementType: N H C H C O C C O N H C H H H O H H S H C O C H H C H H C H N H H C O O H H
charge: 1
multiplicity: 1
keywords: wB97X-D3BJ Opt Freq def2-TZVPP def2/J RIJCOSX VeryTightSCF
keywords: PAL8 defgrid3 TightOpt
frequency: 0.00 0.00 0.00 0.00 0.00 0.00 28.79 32.35 57.35 62.58 76.27 88.52 94.81 112.97 125.20 168.15 175.64 183.64 197.57 206.65 230.58 240.39 259.28 296.68 302.87 325.26 344.00 348.03 360.54 392.11 443.59 459.88 488.23 518.90 548.35 559.22 574.92 587.42 616.11 653.12 717.55 733.69 753.75 766.37 784.98 792.01 800.09 810.77 838.24 867.85 903.33 919.12 932.93 945.61 977.39 982.57 1009.83 1040.19 1053.78 1060.48 1117.24 1119.51 1147.13 1153.95 1173.85 1226.98 1245.43 1256.37 1259.88 1279.62 1302.73 1307.89 1328.21 1348.99 1370.04 1373.33 1377.01 1390.65 1399.23 1410.66 1436.37 1449.01 1460.98 1472.52 1483.79 1487.36 1499.04 1514.36 1549.38 1582.22 1620.93 1678.56 1715.69 1748.93 1815.10 1844.30 2709.17 2753.17 3090.56 3099.41 3112.27 3113.94 3127.10 3138.66 3148.34 3160.94 3173.57 3203.60 3206.20 3483.75 3546.04 3565.56 3596.54 3658.42
frequency: 28.79 32.35 57.35 62.58 76.27 88.52 94.81 112.97 125.20 168.15 175.64 183.64 197.57 206.65 230.58 240.39 259.28 296.68 302.87 325.26 344.00 348.03 360.54 392.11 443.59 459.88 488.23 518.90 548.35 559.22 574.92 587.42 616.11 653.12 717.55 733.69 753.75 766.37 784.98 792.01 800.09 810.77 838.24 867.85 903.33 919.12 932.93 945.61 977.39 982.57 1009.83 1040.19 1053.78 1060.48 1117.24 1119.51 1147.13 1153.95 1173.85 1226.98 1245.43 1256.37 1259.88 1279.62 1302.73 1307.89 1328.21 1348.99 1370.04 1373.33 1377.01 1390.65 1399.23 1410.66 1436.37 1449.01 1460.98 1472.52 1483.79 1487.36 1499.04 1514.36 1549.38 1582.22 1620.93 1678.56 1715.69 1748.93 1815.10 1844.30 2709.17 2753.17 3090.56 3099.41 3112.27 3113.94 3127.10 3138.66 3148.34 3160.94 3173.57 3203.60 3206.20 3483.75 3546.04 3565.56 3596.54 3658.42
formula: C10H18N3O6S
InChI: InChI=1S/C10H18N3O6S/c11-5(10(18)19)1-2-7(14)13-6(4-20)9(17)12-3-8(15)16/h5-6,12-13,15,18,20H,1-4H2,11H3
38 atoms
N  -1.298644 -1.426107 -2.654606
H  -0.546757 -2.093591 -2.590482
C  -1.640672 -0.948458 -3.991683
H  -1.498766 -1.752438 -4.707854
C  -0.683624 0.192435 -4.326038
O  0.284141 0.040383 -5.04061
C  -1.605368 -0.688605 -1.569536
C  -0.930613 -1.079436 -0.251988
O  -2.310598 0.313189 -1.62019
N  0.010745 0.004706 0.00315
H  -0.384962 -2.012658 -0.361831
C  -1.939509 -1.213762 0.88604
H  -0.39653 0.931317 0.022227
H  -2.436321 -0.256647 1.046237
H  -2.711635 -1.936559 0.625127
O  -0.895469 1.339332 -3.699981
H  -1.639152 1.251269 -3.070198
H  -2.679031 -0.618344 -4.002037
S  -1.148133 -1.677247 2.443449
H  -1.125934 -2.996809 2.222777
C  1.348647 -0.003518 0.009578
O  1.958225 1.078747 0.036078
C  2.093921 -1.317632 0.020248
H  2.136551 -1.635868 1.065829
H  1.543738 -2.080673 -0.518386
C  3.520698 -1.237781 -0.5405
H  3.867366 -2.258875 -0.696773
H  4.19353 -0.800246 0.201068
C  3.715975 -0.472535 -1.857707
H  4.59653 -0.855582 -2.3782
N  3.964949 0.982729 -1.580462
H  3.233301 1.250333 -0.851177
H  4.899289 1.138535 -1.21046
C  2.550998 -0.598135 -2.846354
O  1.817907 -1.553161 -2.848304
O  2.495726 0.433868 -3.668499
H  1.722211 0.355952 -4.297668
H  3.835337 1.535174 -2.428763
totalener: -1406.24473632 hartree
nucrepener: 1945.86743021 hartree
electener: -3352.11216652 hartree
oneelecener: -5774.86575289 hartree
twoeener: 2422.75358637 hartree
kineticenergy: 1400.65523588 hartree
exchangeener: -105.333440181155 hartree
correlationener: -7.061451174456 hartree
xcener: -112.394891355611 hartree
temp: 298.15 k
press: 1.00 atm
thermalcorrenthalpy: 0.00094421 hartree
totalenthalpy: -1405.99992802 hartree
totalentropycorr: -0.06388073 hartree
gibbsenthalpy: -1406.06380875 hartree
gibbsminuselec: 0.26402904 hartree
chargesum: 1.0000000
charge: -0.163504 0.200895 -0.111781 0.143793 0.304334 -0.329819 0.223066 0.007544 -0.405393 -0.129451 0.094812 -0.140214 0.201447 0.133306 0.127199 -0.222560 0.247378 0.158323 -0.125659 0.102826 0.232857 -0.406096 -0.143748 0.139074 0.120686 -0.213668 0.130516 0.122567 -0.007238 0.162306 -0.061471 0.230644 0.218729 0.329485 -0.340707 -0.325562 0.268229 0.226853
charge: 0.342871 -0.016266 -0.020887 0.040262 -0.419825 0.160877 -0.372345 -0.141769 0.102301 0.368114 0.026229 -0.235293 0.008839 0.018861 0.015606 0.396631 -0.119638 0.037605 0.495728 -0.149081 -0.342599 0.125104 -0.005161 0.046936 0.019780 0.009820 0.044007 0.034312 -0.043714 0.046794 0.600478 -0.058689 0.037987 -0.446307 0.126165 0.369204 -0.134331 0.031395
qa: -0.1635 0.2009 -0.1118 0.1438 0.3043 -0.3298 0.2231 0.0075 -0.4054 -0.1295 0.0948 -0.1402 0.2014 0.1333 0.1272 -0.2226 0.2474 0.1583 -0.1257 0.1028 0.2329 -0.4061 -0.1437 0.1391 0.1207 -0.2137 0.1305 0.1226 -0.0072 0.1623 -0.0615 0.2306 0.2187 0.3295 -0.3407 -0.3256 0.2682 0.2269
va: 3.2088 1.0096 3.8672 1.0102 4.2275 2.1656 4.2503 3.9803 2.1124 3.1846 1.0233 3.9700 1.0186 1.0165 1.0083 2.2525 1.0437 1.0011 2.1718 1.0234 4.2573 2.1001 3.7509 1.0234 1.0248 3.9286 1.0052 1.0061 3.8564 0.9977 3.5749 1.0867 0.9830 4.2944 2.1482 2.1904 1.0792 0.9997
dispcorr: -0.083101111 hartree
energy: -1406.333935914110
dipole: 7.52249 -4.62669 2.89580 -4.54921 3.94689 -0.60232 3.63464 -3.51740 0.11724
magnitude: 2.96010 au
magnitude: 7.52398 debye
zeropoint: 0.31139130 hartree
thermalvibcorrection: 0.01762120 hartree
thermalrotcorrection: 0.00141627 hartree
thermaltrasncorrection: 0.00141627 hartree
thermaltotal: -1406.00209088 hartree
thermalcorr: 0.02045374 hartree
nonthermalcorr: 0.31139130 hartree
totalcorr: 0.33184504 hartree
totalenthalpy: -1406.00114667 hartree
