program: Orca
programVersion: 5.0.2
elementType: N H C H C O C C O N H C H H H O H H S H C O C H H C H H C H N H H C O O H H
charge: 1
multiplicity: 1
keywords: wB97X-D3BJ Opt Freq def2-TZVPP def2/J RIJCOSX VeryTightSCF
keywords: PAL8 defgrid3 TightOpt
frequency: 0.00 0.00 0.00 0.00 0.00 0.00 18.57 22.96 28.77 36.61 49.46 63.01 77.05 88.92 96.77 123.92 134.20 147.50 185.35 223.74 242.85 246.93 257.65 280.98 305.23 314.37 341.36 350.24 372.08 412.05 435.94 461.57 508.99 516.74 524.85 528.80 541.66 585.59 608.98 645.87 650.62 658.99 672.08 696.12 725.54 734.39 749.76 783.98 812.44 847.81 869.67 879.23 890.54 922.68 949.19 991.67 1010.58 1047.44 1064.66 1074.80 1115.02 1118.43 1135.62 1165.81 1194.40 1198.87 1209.27 1232.64 1248.34 1262.81 1291.21 1308.42 1315.06 1319.23 1338.25 1354.38 1370.56 1374.89 1415.33 1421.82 1424.84 1447.47 1456.62 1463.97 1470.26 1494.37 1512.95 1526.44 1558.57 1568.57 1633.05 1671.96 1714.60 1803.81 1840.13 1890.67 2074.64 2750.85 3080.88 3100.70 3104.13 3112.82 3122.16 3122.43 3151.74 3152.14 3173.38 3208.00 3509.14 3573.65 3648.86 3675.88 3789.10 3806.00
frequency: 18.57 22.96 28.77 36.61 49.46 63.01 77.05 88.92 96.77 123.92 134.20 147.50 185.35 223.74 242.85 246.93 257.65 280.98 305.23 314.37 341.36 350.24 372.08 412.05 435.94 461.57 508.99 516.74 524.85 528.80 541.66 585.59 608.98 645.87 650.62 658.99 672.08 696.12 725.54 734.39 749.76 783.98 812.44 847.81 869.67 879.23 890.54 922.68 949.19 991.67 1010.58 1047.44 1064.66 1074.80 1115.02 1118.43 1135.62 1165.81 1194.40 1198.87 1209.27 1232.64 1248.34 1262.81 1291.21 1308.42 1315.06 1319.23 1338.25 1354.38 1370.56 1374.89 1415.33 1421.82 1424.84 1447.47 1456.62 1463.97 1470.26 1494.37 1512.95 1526.44 1558.57 1568.57 1633.05 1671.96 1714.60 1803.81 1840.13 1890.67 2074.64 2750.85 3080.88 3100.70 3104.13 3112.82 3122.16 3122.43 3151.74 3152.14 3173.38 3208.00 3509.14 3573.65 3648.86 3675.88 3789.10 3806.00
formula: C10H18N3O6S
InChI: InChI=1S/C10H18N3O6S/c11-5(10(18)19)1-2-7(14)13-6(4-20)9(17)12-3-8(15)16/h5-6,12-13,15,18,20H,1-4H2,11H3
38 atoms
N  -1.544581 -3.080476 1.334096
H  -2.10264 -3.317066 0.531927
C  -1.178456 -4.163153 2.215316
H  -0.971752 -3.782896 3.215188
C  0.064987 -4.879745 1.706061
O  0.654488 -4.594806 0.694372
C  -0.701378 -2.017587 1.239943
C  -0.867951 -1.161355 -0.030644
O  0.135487 -1.763773 2.078895
N  0.029906 -0.028582 0.003868
H  -1.870101 -0.729872 -0.005544
C  -0.776818 -2.056868 -1.303403
H  -0.38214 0.889397 0.061254
H  -0.181648 -2.948768 -1.104298
H  -1.777739 -2.404148 -1.55896
O  0.417933 -5.872079 2.524833
H  1.201579 -6.30561 2.161141
H  -1.997593 -4.877644 2.294175
S  -0.0263 -1.311674 -2.760708
H  -0.907431 -0.319429 -2.934865
C  1.362303 -0.012474 -0.011367
O  1.938461 1.096254 -0.004291
C  2.156698 -1.296068 -0.005284
H  2.427472 -1.473659 1.039008
H  1.537588 -2.14299 -0.280708
C  3.402013 -1.284614 -0.900866
H  3.164728 -0.876412 -1.887831
H  3.711406 -2.318567 -1.053176
C  4.621702 -0.562867 -0.316291
H  4.744858 -0.853632 0.728593
N  4.431948 0.916423 -0.346377
H  4.656497 1.284695 -1.268778
H  3.352424 1.099136 -0.136662
C  5.891812 -0.996101 -1.042773
O  6.258953 -2.131168 -1.076333
O  6.522736 0.035394 -1.634009
H  7.310374 -0.304609 -2.082174
H  5.033302 1.392971 0.320404
totalener: -1406.24266026 hartree
nucrepener: 1838.91427768 hartree
electener: -3245.15693794 hartree
oneelecener: -5562.85866110 hartree
twoeener: 2317.70172316 hartree
kineticenergy: 1400.65331330 hartree
exchangeener: -105.325008477073 hartree
correlationener: -7.054000695784 hartree
xcener: -112.379009172857 hartree
temp: 298.15 k
press: 1.00 atm
thermalcorrenthalpy: 0.00094421 hartree
totalenthalpy: -1405.99516199 hartree
totalentropycorr: -0.06602042 hartree
gibbsenthalpy: -1406.06118241 hartree
gibbsminuselec: 0.26147686 hartree
chargesum: 1.0000000
charge: -0.191798 0.172393 -0.075433 0.141010 0.318325 -0.348373 0.210624 0.010714 -0.348317 -0.127321 0.149406 -0.208425 0.191421 0.142618 0.138211 -0.251779 0.239248 0.143050 -0.133609 0.105237 0.280391 -0.398937 -0.153112 0.135539 0.107012 -0.207953 0.114451 0.150360 0.006490 0.140547 -0.084137 0.210041 0.217623 0.272154 -0.252364 -0.287618 0.252736 0.219578
charge: 0.326691 -0.023323 -0.039538 0.044128 -0.432836 0.097829 -0.384374 -0.127077 0.114779 0.365790 0.041681 -0.258084 0.000047 0.007398 0.004099 0.383166 -0.080246 0.038429 0.510703 -0.145996 -0.313695 0.173326 -0.004183 0.047123 0.033734 0.005161 0.031511 0.048520 -0.060470 0.048631 0.577526 0.029463 -0.107112 -0.434537 0.163986 0.355873 -0.068909 0.030785
qa: -0.1918 0.1724 -0.0754 0.1410 0.3183 -0.3484 0.2106 0.0107 -0.3483 -0.1273 0.1494 -0.2084 0.1914 0.1426 0.1382 -0.2518 0.2392 0.1430 -0.1336 0.1052 0.2804 -0.3989 -0.1531 0.1355 0.1070 -0.2080 0.1145 0.1504 0.0065 0.1405 -0.0841 0.2100 0.2176 0.2722 -0.2524 -0.2876 0.2527 0.2196
va: 3.1967 1.0198 3.8288 1.0179 4.2483 2.1189 4.3176 3.7314 2.1639 3.2120 0.9841 3.9456 1.0132 1.0112 0.9972 2.2413 1.0176 1.0064 2.1902 1.0236 4.2322 2.1246 3.8122 1.0200 1.0187 3.9325 1.0210 1.0136 3.8089 1.0066 3.4992 1.0029 1.1206 4.3790 2.2519 2.1956 1.0098 0.9854
dispcorr: -0.080520249 hartree
energy: -1406.327700665062
dipole: -1.41590 2.31474 0.89883 2.95194 -1.21836 1.73358 -0.80109 0.32821 -0.47288
magnitude: 2.00918 au
magnitude: 5.10693 debye
zeropoint: 0.30945927 hartree
thermalvibcorrection: 0.01847960 hartree
thermalrotcorrection: 0.00141627 hartree
thermaltrasncorrection: 0.00141627 hartree
thermaltotal: -1405.99692925 hartree
thermalcorr: 0.02131215 hartree
nonthermalcorr: 0.30945927 hartree
totalcorr: 0.33077141 hartree
totalenthalpy: -1405.99598504 hartree
