program: Orca
programVersion: 5.0.2
elementType: N H C H C O C C O N H C H H H O H H S H C O C H H C H H C H N H H C O O H H
charge: 1
multiplicity: 1
keywords: wB97X-D3BJ Opt Freq def2-TZVPP def2/J RIJCOSX VeryTightSCF
keywords: PAL8 defgrid3 TightOpt
frequency: 0.00 0.00 0.00 0.00 0.00 0.00 6.54 23.04 25.12 35.69 55.92 62.51 69.45 79.36 95.35 107.04 136.30 188.60 196.23 210.54 235.75 270.23 285.42 293.26 296.92 325.64 339.20 352.43 358.32 408.90 477.01 496.15 499.42 509.44 516.12 519.43 569.16 583.25 605.46 620.87 636.34 656.54 667.44 685.89 721.11 723.13 746.14 763.18 803.96 845.22 855.16 877.09 906.48 920.05 948.85 1002.41 1028.43 1030.45 1046.30 1077.47 1134.09 1139.54 1149.10 1160.68 1184.95 1198.83 1208.74 1245.42 1251.18 1264.89 1291.97 1316.72 1325.04 1333.68 1356.76 1368.50 1372.52 1389.36 1394.52 1404.18 1414.29 1455.66 1462.60 1466.25 1474.91 1480.57 1496.58 1539.11 1550.44 1587.31 1616.70 1680.63 1715.73 1796.07 1854.85 1882.27 2540.75 2759.06 3074.40 3092.19 3106.29 3106.47 3115.32 3121.84 3147.06 3164.87 3167.73 3176.94 3398.82 3569.59 3611.12 3675.62 3785.97 3794.08
frequency: 6.54 23.04 25.12 35.69 55.92 62.51 69.45 79.36 95.35 107.04 136.30 188.60 196.23 210.54 235.75 270.23 285.42 293.26 296.92 325.64 339.20 352.43 358.32 408.90 477.01 496.15 499.42 509.44 516.12 519.43 569.16 583.25 605.46 620.87 636.34 656.54 667.44 685.89 721.11 723.13 746.14 763.18 803.96 845.22 855.16 877.09 906.48 920.05 948.85 1002.41 1028.43 1030.45 1046.30 1077.47 1134.09 1139.54 1149.10 1160.68 1184.95 1198.83 1208.74 1245.42 1251.18 1264.89 1291.97 1316.72 1325.04 1333.68 1356.76 1368.50 1372.52 1389.36 1394.52 1404.18 1414.29 1455.66 1462.60 1466.25 1474.91 1480.57 1496.58 1539.11 1550.44 1587.31 1616.70 1680.63 1715.73 1796.07 1854.85 1882.27 2540.75 2759.06 3074.40 3092.19 3106.29 3106.47 3115.32 3121.84 3147.06 3164.87 3167.73 3176.94 3398.82 3569.59 3611.12 3675.62 3785.97 3794.08
formula: C10H18N3O6S
InChI: InChI=1S/C10H18N3O6S/c11-5(10(18)19)1-2-7(14)13-6(4-20)9(17)12-3-8(15)16/h5-6,12-13,15,18,20H,1-4H2,11H3
38 atoms
N  -0.683686 -2.476142 1.592977
H  -0.892639 -1.632356 2.098713
C  -0.48956 -3.703505 2.330001
H  -1.359508 -3.930751 2.949125
C  0.719429 -3.740856 3.246359
O  0.977512 -4.672178 3.949671
C  -0.611514 -2.429415 0.240848
C  -0.935882 -1.053471 -0.365326
O  -0.357426 -3.391792 -0.455292
N  0.002903 0.001193 0.015742
H  -1.890479 -0.759464 0.082981
C  -1.172599 -1.11979 -1.876745
H  -0.374055 0.937828 -0.030479
H  -1.895866 -1.904069 -2.092749
H  -1.609897 -0.173319 -2.198846
O  1.474134 -2.614837 3.204453
H  2.178187 -2.741056 3.855567
H  -0.382561 -4.515427 1.610942
S  0.285959 -1.34763 -2.916045
H  0.416628 -2.658914 -2.685396
C  1.350364 0.011167 0.008582
O  1.926462 1.111395 0.017928
C  2.118063 -1.287829 0.086593
H  1.76091 -1.818996 0.969837
H  1.861295 -1.907391 -0.770243
C  3.633942 -1.140759 0.231761
H  4.037173 -2.13558 0.422655
H  3.874026 -0.533623 1.107949
C  4.411718 -0.579092 -0.963453
H  5.475113 -0.777516 -0.813676
N  4.232606 0.898275 -1.109448
H  3.302835 1.14868 -0.628538
H  4.99334 1.423884 -0.68908
C  4.046983 -1.182653 -2.31713
O  3.851443 -0.506676 -3.291504
O  4.017918 -2.508681 -2.274827
H  3.833933 -2.847807 -3.162915
H  4.171934 1.114258 -2.111219
totalener: -1406.23858169 hartree
nucrepener: 1898.60487421 hartree
electener: -3304.84345590 hartree
oneelecener: -5681.17731072 hartree
twoeener: 2376.33385482 hartree
kineticenergy: 1400.66823327 hartree
exchangeener: -105.324875339341 hartree
correlationener: -7.055627053269 hartree
xcener: -112.380502392610 hartree
temp: 298.15 k
press: 1.00 atm
thermalcorrenthalpy: 0.00094421 hartree
totalenthalpy: -1405.99157476 hartree
totalentropycorr: -0.06560575 hartree
gibbsenthalpy: -1406.05718050 hartree
gibbsminuselec: 0.26286462 hartree
chargesum: 1.0000000
charge: -0.202252 0.188788 -0.088758 0.150319 0.289938 -0.268486 0.224842 -0.003865 -0.352736 -0.182724 0.140687 -0.156885 0.189437 0.139959 0.129571 -0.298947 0.234957 0.145048 -0.165545 0.133829 0.257878 -0.391671 -0.075647 0.104330 0.104135 -0.261963 0.137030 0.132415 0.005550 0.148370 -0.071524 0.224485 0.219003 0.282165 -0.287980 -0.247057 0.254337 0.218966
charge: 0.331448 -0.018956 -0.031711 0.041464 -0.432373 0.145199 -0.397349 -0.136354 0.101421 0.342925 0.043870 -0.236755 -0.000059 0.019876 0.012961 0.336880 -0.087302 0.046815 0.501969 -0.145903 -0.330459 0.140442 -0.011632 0.036409 0.019724 0.001135 0.045713 0.035703 -0.051906 0.047475 0.600420 -0.074209 0.034286 -0.442894 0.146683 0.403425 -0.065147 0.026764
qa: -0.2023 0.1888 -0.0888 0.1503 0.2899 -0.2685 0.2248 -0.0039 -0.3527 -0.1827 0.1407 -0.1569 0.1894 0.1400 0.1296 -0.2989 0.2350 0.1450 -0.1655 0.1338 0.2579 -0.3917 -0.0756 0.1043 0.1041 -0.2620 0.1370 0.1324 0.0056 0.1484 -0.0715 0.2245 0.2190 0.2822 -0.2880 -0.2471 0.2543 0.2190
va: 3.1595 1.0099 3.7755 1.0023 4.3062 2.2435 4.2582 3.8139 2.1590 3.1686 0.9969 3.9702 1.0139 1.0095 1.0037 2.1333 1.0212 1.0306 2.1875 1.0219 4.2366 2.1089 3.5742 1.0650 1.0907 3.9635 1.0072 1.0057 3.8788 1.0003 3.5592 1.1012 0.9830 4.3559 2.1963 2.2645 1.0055 1.0185
dispcorr: -0.081851277 hartree
energy: -1406.325370040302
dipole: 2.11731 -0.18365 1.93366 4.30379 -1.86139 2.44240 1.59880 -1.49984 0.09896
magnitude: 3.11675 au
magnitude: 7.92215 debye
zeropoint: 0.31021449 hartree
thermalvibcorrection: 0.01842856 hartree
thermalrotcorrection: 0.00141627 hartree
thermaltrasncorrection: 0.00141627 hartree
thermaltotal: -1405.99389445 hartree
thermalcorr: 0.02126110 hartree
nonthermalcorr: 0.31021449 hartree
totalcorr: 0.33147559 hartree
totalenthalpy: -1405.99295024 hartree
