program: Orca
programVersion: 5.0.2
elementType: N H C H C O C C O N H C H H H O H H S H C O C H H C H H C H N H H C O O H H
charge: 1
multiplicity: 1
keywords: wB97X-D3BJ Opt Freq def2-TZVPP def2/J RIJCOSX VeryTightSCF
keywords: PAL8 defgrid3 TightOpt
frequency: 0.00 0.00 0.00 0.00 0.00 0.00 16.69 25.11 39.80 43.36 54.70 64.23 80.27 82.33 89.64 130.26 152.54 168.92 176.46 183.54 211.16 225.65 232.20 267.80 273.57 286.54 302.73 319.77 336.31 357.58 393.84 424.29 476.04 491.26 518.47 546.87 577.43 582.34 598.33 607.56 634.62 655.24 657.17 690.92 713.60 766.22 773.38 781.74 827.21 851.20 862.48 887.11 889.07 925.15 954.71 971.45 980.47 1042.72 1052.54 1082.88 1104.02 1114.94 1125.79 1147.14 1192.47 1202.31 1204.34 1215.42 1251.48 1280.68 1297.74 1298.85 1312.97 1336.38 1358.48 1364.91 1368.98 1372.79 1384.90 1411.67 1414.30 1463.99 1470.97 1474.80 1482.31 1489.83 1500.61 1502.90 1514.63 1603.27 1637.53 1674.44 1747.14 1779.85 1833.49 1868.47 2763.53 3061.02 3071.27 3094.73 3099.55 3110.93 3131.67 3159.74 3165.16 3171.32 3188.01 3339.01 3499.61 3556.45 3581.77 3631.44 3782.63 3810.47
frequency: 16.69 25.11 39.80 43.36 54.70 64.23 80.27 82.33 89.64 130.26 152.54 168.92 176.46 183.54 211.16 225.65 232.20 267.80 273.57 286.54 302.73 319.77 336.31 357.58 393.84 424.29 476.04 491.26 518.47 546.87 577.43 582.34 598.33 607.56 634.62 655.24 657.17 690.92 713.60 766.22 773.38 781.74 827.21 851.20 862.48 887.11 889.07 925.15 954.71 971.45 980.47 1042.72 1052.54 1082.88 1104.02 1114.94 1125.79 1147.14 1192.47 1202.31 1204.34 1215.42 1251.48 1280.68 1297.74 1298.85 1312.97 1336.38 1358.48 1364.91 1368.98 1372.79 1384.90 1411.67 1414.30 1463.99 1470.97 1474.80 1482.31 1489.83 1500.61 1502.90 1514.63 1603.27 1637.53 1674.44 1747.14 1779.85 1833.49 1868.47 2763.53 3061.02 3071.27 3094.73 3099.55 3110.93 3131.67 3159.74 3165.16 3171.32 3188.01 3339.01 3499.61 3556.45 3581.77 3631.44 3782.63 3810.47
formula: C10H18N3O6S
InChI: InChI=1S/C10H18N3O6S/c11-5(10(18)19)1-2-7(14)13-6(4-20)9(17)12-3-8(15)16/h5-6,12-13,15,18,20H,1-4H2,11H3
38 atoms
N  -1.855705 -2.272747 -2.227758
H  -2.690825 -2.435291 -1.684346
C  -1.764481 -2.745791 -3.591707
H  -0.946907 -3.455799 -3.711012
C  -1.536381 -1.639004 -4.609959
O  -0.883652 -1.776127 -5.606252
C  -0.819928 -1.609512 -1.693843
C  -0.932505 -1.144835 -0.221864
O  0.206288 -1.404323 -2.330208
N  -0.046304 -0.025494 0.026492
H  -0.616301 -1.991742 0.396058
C  -2.344669 -0.73149 0.217743
H  -0.449596 0.897925 -0.027076
H  -2.255799 -0.139115 1.12672
H  -2.817775 -0.126731 -0.556961
O  -2.193918 -0.508205 -4.296172
H  -2.033907 0.119413 -5.013073
H  -2.698778 -3.247137 -3.847999
S  -3.357374 -2.196922 0.57178
H  -4.533747 -1.564066 0.634076
C  1.311977 -0.010045 -0.007892
O  1.933296 1.038687 0.007527
C  2.063181 -1.329368 -0.009643
H  2.309712 -1.556084 1.031294
H  1.468921 -2.15005 -0.399811
C  3.371082 -1.204619 -0.788145
H  3.884161 -2.169729 -0.720948
H  4.009611 -0.450578 -0.324546
C  3.19683 -0.862486 -2.277922
H  2.362574 -1.392941 -2.732799
N  4.480427 -1.249243 -2.982977
H  5.146186 -0.483156 -2.799142
H  4.852241 -2.133907 -2.641894
C  3.129991 0.646886 -2.548523
O  4.152651 1.287907 -2.572711
O  1.923977 1.100447 -2.811661
H  1.968461 2.066083 -2.873668
H  4.353616 -1.312883 -3.993269
totalener: -1406.21916585 hartree
nucrepener: 1855.97669855 hartree
electener: -3262.19586440 hartree
oneelecener: -5597.37858407 hartree
twoeener: 2335.18271967 hartree
kineticenergy: 1400.63662636 hartree
exchangeener: -105.314445122675 hartree
correlationener: -7.050237471746 hartree
xcener: -112.364682594421 hartree
temp: 298.15 k
press: 1.00 atm
thermalcorrenthalpy: 0.00094421 hartree
totalenthalpy: -1405.96820183 hartree
totalentropycorr: -0.06640881 hartree
gibbsenthalpy: -1406.03461064 hartree
gibbsminuselec: 0.26328435 hartree
chargesum: 1.0000000
charge: -0.174465 0.174866 -0.081713 0.121863 0.301298 -0.300595 0.308838 0.028120 -0.455340 -0.167058 0.114520 -0.214659 0.168996 0.140571 0.145356 -0.273991 0.231906 0.125739 -0.141513 0.126531 0.211955 -0.358258 -0.162477 0.135635 0.087786 -0.192636 0.091855 0.149529 -0.002103 0.183590 -0.042617 0.239287 0.226533 0.281877 -0.312243 -0.208650 0.248091 0.243578
charge: 0.337909 -0.065955 -0.035585 0.034805 -0.443550 0.120281 -0.375174 -0.141695 0.077739 0.336278 0.034948 -0.223913 -0.009460 0.008479 0.008330 0.357083 -0.087117 0.039049 0.513880 -0.138524 -0.381875 0.085487 -0.001800 0.043629 0.022084 -0.001613 0.024990 0.041499 -0.023991 0.031990 0.614244 0.048074 0.046747 -0.449632 0.131039 0.425303 -0.062536 0.058553
qa: -0.1745 0.1749 -0.0817 0.1219 0.3013 -0.3006 0.3088 0.0281 -0.4553 -0.1671 0.1145 -0.2147 0.1690 0.1406 0.1454 -0.2740 0.2319 0.1257 -0.1415 0.1265 0.2120 -0.3583 -0.1625 0.1356 0.0878 -0.1926 0.0919 0.1495 -0.0021 0.1836 -0.0426 0.2393 0.2265 0.2819 -0.3122 -0.2087 0.2481 0.2436
va: 3.1924 1.0719 3.8559 1.0212 4.2897 2.2131 4.0725 3.8628 2.0308 3.1415 0.9928 3.9960 1.0314 1.0024 0.9931 2.1858 1.0232 1.0004 2.1883 1.0173 4.3515 2.1609 3.8578 1.0045 1.0241 3.9606 1.0090 1.0136 3.7795 1.0331 3.6612 1.0064 0.9798 4.3677 2.1803 2.3088 1.0092 0.9683
dispcorr: -0.079764272 hartree
energy: -1406.304301384041
dipole: 5.83415 -3.40428 2.42988 -5.09725 3.90015 -1.19710 3.60668 -4.08954 -0.48286
magnitude: 2.75146 au
magnitude: 6.99364 debye
zeropoint: 0.31065213 hartree
thermalvibcorrection: 0.01894956 hartree
thermalrotcorrection: 0.00141627 hartree
thermaltrasncorrection: 0.00141627 hartree
thermaltotal: -1405.97186715 hartree
thermalcorr: 0.02178211 hartree
nonthermalcorr: 0.31065213 hartree
totalcorr: 0.33243423 hartree
totalenthalpy: -1405.97092294 hartree
