program: Orca
programVersion: 5.0.2
elementType: N H C H C O C C O N H C H H H O H H S H C O C H H C H H C H N H H C O O H H
charge: 1
multiplicity: 1
keywords: wB97X-D3BJ Opt Freq def2-TZVPP def2/J RIJCOSX VeryTightSCF
keywords: PAL8 defgrid3 TightOpt
frequency: 0.00 0.00 0.00 0.00 0.00 0.00 23.06 27.04 34.77 50.25 58.73 68.82 81.06 96.02 101.40 115.01 134.29 170.35 219.46 238.09 243.83 265.36 287.42 295.32 307.07 325.34 345.18 361.36 388.37 393.58 428.20 474.47 484.71 507.82 520.42 540.02 574.14 584.87 594.67 615.36 654.34 661.48 692.67 713.02 728.28 739.58 751.37 802.14 823.53 852.91 859.46 879.63 893.94 913.23 965.14 1016.50 1024.79 1043.53 1056.82 1076.52 1129.65 1135.06 1161.36 1176.42 1191.95 1196.85 1210.67 1222.46 1230.60 1279.25 1294.99 1307.96 1314.14 1323.04 1332.94 1358.35 1361.39 1373.81 1404.10 1406.27 1422.08 1461.39 1462.45 1471.02 1482.96 1493.05 1504.42 1537.66 1579.70 1593.95 1623.27 1688.09 1714.71 1775.35 1847.80 1871.31 2252.59 2746.71 3070.42 3093.02 3105.86 3110.84 3114.31 3121.33 3146.93 3163.13 3168.70 3218.97 3421.94 3567.03 3572.27 3636.50 3789.13 3848.10
frequency: 23.06 27.04 34.77 50.25 58.73 68.82 81.06 96.02 101.40 115.01 134.29 170.35 219.46 238.09 243.83 265.36 287.42 295.32 307.07 325.34 345.18 361.36 388.37 393.58 428.20 474.47 484.71 507.82 520.42 540.02 574.14 584.87 594.67 615.36 654.34 661.48 692.67 713.02 728.28 739.58 751.37 802.14 823.53 852.91 859.46 879.63 893.94 913.23 965.14 1016.50 1024.79 1043.53 1056.82 1076.52 1129.65 1135.06 1161.36 1176.42 1191.95 1196.85 1210.67 1222.46 1230.60 1279.25 1294.99 1307.96 1314.14 1323.04 1332.94 1358.35 1361.39 1373.81 1404.10 1406.27 1422.08 1461.39 1462.45 1471.02 1482.96 1493.05 1504.42 1537.66 1579.70 1593.95 1623.27 1688.09 1714.71 1775.35 1847.80 1871.31 2252.59 2746.71 3070.42 3093.02 3105.86 3110.84 3114.31 3121.33 3146.93 3163.13 3168.70 3218.97 3421.94 3567.03 3572.27 3636.50 3789.13 3848.10
formula: C10H18N3O6S
InChI: InChI=1S/C10H18N3O6S/c11-5(10(18)19)1-2-7(14)13-6(4-20)9(17)12-3-8(15)16/h5-6,12-13,15,18,20H,1-4H2,11H3
38 atoms
N  -0.974077 -2.921729 2.077421
H  -1.652408 -3.332892 1.451447
C  -0.34276 -3.742347 3.075421
H  -0.196523 -3.17436 3.996932
C  1.018144 -4.250965 2.589807
O  1.426502 -4.099792 1.472255
C  -0.358603 -1.778821 1.708118
C  -0.856621 -1.123055 0.398941
O  0.542626 -1.280043 2.357699
N  0.003684 0.003649 0.070454
H  -1.835803 -0.690664 0.615657
C  -1.025175 -2.080901 -0.798594
H  -0.391794 0.925805 0.175362
H  -1.048481 -1.486092 -1.710044
H  -0.187731 -2.774134 -0.87495
O  1.752451 -4.896197 3.506069
H  1.307794 -4.931468 4.359615
H  -0.983775 -4.597015 3.298793
S  -2.487582 -3.142609 -0.740033
H  -3.406345 -2.16857 -0.758352
C  1.344181 0.014947 0.033802
O  1.93443 1.109301 0.037319
C  2.129273 -1.271095 -0.098565
H  1.515806 -2.145615 0.080547
H  2.453956 -1.321854 -1.14408
C  3.325082 -1.347852 0.863831
H  3.554944 -2.39979 1.030013
H  3.040353 -0.935808 1.8330
C  4.615318 -0.67944 0.382789
H  5.409059 -0.877157 1.105816
N  4.468378 0.798983 0.226426
H  3.404032 1.028628 0.100967
H  4.821506 1.305842 1.03254
C  5.098637 -1.200276 -0.96669
O  5.354694 -0.472821 -1.89104
O  5.206837 -2.522374 -0.976231
H  5.544279 -2.804321 -1.838638
H  4.97759 1.087133 -0.614912
totalener: -1406.24580047 hartree
nucrepener: 1871.84202213 hartree
electener: -3278.08782260 hartree
oneelecener: -5628.54836145 hartree
twoeener: 2350.46053885 hartree
kineticenergy: 1400.65760934 hartree
exchangeener: -105.326452217166 hartree
correlationener: -7.056794815986 hartree
xcener: -112.383247033152 hartree
temp: 298.15 k
press: 1.00 atm
thermalcorrenthalpy: 0.00094421 hartree
totalenthalpy: -1405.99912292 hartree
totalentropycorr: -0.06515743 hartree
gibbsenthalpy: -1406.06428035 hartree
gibbsminuselec: 0.26290721 hartree
chargesum: 1.0000000
charge: -0.188834 0.172912 -0.139962 0.130453 0.337952 -0.330574 0.211067 0.055095 -0.374968 -0.158039 0.128538 -0.189396 0.190092 0.140064 0.135253 -0.220394 0.220336 0.151563 -0.121078 0.109837 0.280083 -0.391423 -0.157740 0.105604 0.125925 -0.202890 0.140863 0.136591 0.001996 0.147728 -0.082244 0.216889 0.215191 0.276533 -0.299109 -0.241611 0.253056 0.214640
charge: 0.332906 -0.070326 -0.057715 0.035076 -0.431839 0.122016 -0.383084 -0.126045 0.100584 0.359596 0.039472 -0.239598 -0.000492 0.009622 0.009741 0.390033 -0.093585 0.036768 0.532311 -0.143476 -0.315993 0.161576 0.001771 0.025617 0.039583 0.004574 0.044933 0.037233 -0.058367 0.045817 0.591053 -0.086644 0.031031 -0.439701 0.135006 0.404250 -0.065868 0.022165
qa: -0.1888 0.1729 -0.1400 0.1305 0.3380 -0.3306 0.2111 0.0551 -0.3750 -0.1580 0.1285 -0.1894 0.1901 0.1401 0.1353 -0.2204 0.2203 0.1516 -0.1211 0.1098 0.2801 -0.3914 -0.1577 0.1056 0.1259 -0.2029 0.1409 0.1366 0.0020 0.1477 -0.0822 0.2169 0.2152 0.2765 -0.2991 -0.2416 0.2531 0.2146
va: 3.1896 1.0789 3.8639 1.0063 4.2251 2.1455 4.2699 3.8083 2.1313 3.2238 0.9982 3.9602 1.0149 1.0057 0.9976 2.2537 1.0212 0.9928 2.2104 1.0209 4.2184 2.1312 3.8269 1.0317 1.0143 3.8621 1.0254 1.0151 3.9426 1.0022 3.5234 1.1213 0.9858 4.3442 2.1906 2.2678 1.0063 1.0177
dispcorr: -0.081983918 hartree
energy: -1406.332532284121
dipole: 1.10949 -0.16586 0.94363 3.46164 -2.34452 1.11712 1.57584 -0.93744 0.63840
magnitude: 1.59561 au
magnitude: 4.05571 debye
zeropoint: 0.31027053 hartree
thermalvibcorrection: 0.01812407 hartree
thermalrotcorrection: 0.00141627 hartree
thermaltrasncorrection: 0.00141627 hartree
thermaltotal: -1406.00130515 hartree
thermalcorr: 0.02095661 hartree
nonthermalcorr: 0.31027053 hartree
totalcorr: 0.33122714 hartree
totalenthalpy: -1406.00036094 hartree
