program: Orca
programVersion: 5.0.2
elementType: N H C H C O C C O N H C H H H O H H S H C O C H H C H H C H N H H C O O H H
charge: 1
multiplicity: 1
keywords: wB97X-D3BJ Opt Freq def2-TZVPP def2/J RIJCOSX VeryTightSCF
keywords: PAL8 defgrid3 TightOpt
frequency: 0.00 0.00 0.00 0.00 0.00 0.00 23.04 28.78 37.09 55.81 59.55 73.78 84.97 93.93 109.31 121.71 134.38 161.40 177.43 186.72 221.78 246.61 266.25 295.16 301.03 306.42 330.22 351.13 396.82 448.20 462.80 473.78 503.62 516.87 532.67 545.60 557.76 574.06 583.74 613.52 640.05 656.03 656.27 684.57 724.59 735.07 741.23 777.84 829.91 839.36 881.50 891.65 906.48 925.62 955.36 959.62 991.90 1043.41 1059.38 1087.93 1097.14 1134.23 1147.33 1155.70 1169.35 1191.30 1198.76 1235.32 1247.95 1283.47 1292.20 1303.31 1317.39 1331.00 1337.47 1342.31 1360.51 1377.46 1396.60 1416.82 1424.30 1447.17 1453.80 1463.21 1478.54 1491.03 1497.96 1503.44 1555.87 1587.96 1616.81 1699.37 1721.68 1793.54 1848.07 1890.13 2373.54 2767.63 3083.48 3090.11 3101.39 3102.37 3113.53 3117.82 3159.29 3161.21 3169.76 3218.79 3509.44 3581.69 3631.39 3659.51 3800.61 3811.21
frequency: 23.04 28.78 37.09 55.81 59.55 73.78 84.97 93.93 109.31 121.71 134.38 161.40 177.43 186.72 221.78 246.61 266.25 295.16 301.03 306.42 330.22 351.13 396.82 448.20 462.80 473.78 503.62 516.87 532.67 545.60 557.76 574.06 583.74 613.52 640.05 656.03 656.27 684.57 724.59 735.07 741.23 777.84 829.91 839.36 881.50 891.65 906.48 925.62 955.36 959.62 991.90 1043.41 1059.38 1087.93 1097.14 1134.23 1147.33 1155.70 1169.35 1191.30 1198.76 1235.32 1247.95 1283.47 1292.20 1303.31 1317.39 1331.00 1337.47 1342.31 1360.51 1377.46 1396.60 1416.82 1424.30 1447.17 1453.80 1463.21 1478.54 1491.03 1497.96 1503.44 1555.87 1587.96 1616.81 1699.37 1721.68 1793.54 1848.07 1890.13 2373.54 2767.63 3083.48 3090.11 3101.39 3102.37 3113.53 3117.82 3159.29 3161.21 3169.76 3218.79 3509.44 3581.69 3631.39 3659.51 3800.61 3811.21
formula: C10H18N3O6S
InChI: InChI=1S/C10H18N3O6S/c11-5(10(18)19)1-2-7(14)13-6(4-20)9(17)12-3-8(15)16/h5-6,12-13,15,18,20H,1-4H2,11H3
38 atoms
N  -0.861648 -3.428589 1.010019
H  -1.130377 -3.740841 0.091986
C  -0.419227 -4.427786 1.950484
H  -0.547945 -4.060461 2.968465
C  1.044645 -4.791238 1.760893
O  1.769477 -4.338821 0.913072
C  -0.474253 -2.141858 1.182716
C  -0.936938 -1.138691 0.106631
O  0.132327 -1.752708 2.158919
N  0.007455 -0.038976 -0.027069
H  -1.8225 -0.689668 0.566853
C  -1.415963 -1.691532 -1.238551
H  -0.382043 0.890046 0.033392
H  -2.329874 -2.265513 -1.080867
H  -1.661819 -0.844957 -1.877052
O  1.423956 -5.698996 2.665035
H  2.35249 -5.915823 2.5089
H  -1.02095 -5.330527 1.843463
S  -0.173219 -2.716457 -2.079997
H  -0.694646 -2.60661 -3.305565
C  1.341285 -0.029318 -0.03444
O  1.924212 1.076805 -0.017881
C  2.169933 -1.289732 -0.041251
H  1.580551 -2.197799 -0.011766
H  2.715002 -1.275235 0.907043
C  3.133759 -1.429627 -1.233833
H  2.570376 -1.753677 -2.108076
H  3.832837 -2.23101 -0.988649
C  3.920062 -0.194276 -1.666019
H  4.804374 -0.49924 -2.230635
N  4.36918 0.615618 -0.489603
H  3.418637 0.939356 -0.056977
H  4.91423 0.061238 0.165275
C  3.116453 0.72221 -2.593442
O  2.18291 0.366365 -3.2467
O  3.648981 1.955957 -2.616768
H  3.136588 2.50543 -3.225683
H  4.909491 1.42723 -0.781708
totalener: -1406.23681227 hartree
nucrepener: 1913.61544588 hartree
electener: -3319.85225815 hartree
oneelecener: -5712.37928979 hartree
twoeener: 2392.52703163 hartree
kineticenergy: 1400.66032598 hartree
exchangeener: -105.324457933568 hartree
correlationener: -7.056894559236 hartree
xcener: -112.381352492804 hartree
temp: 298.15 k
press: 1.00 atm
thermalcorrenthalpy: 0.00094421 hartree
totalenthalpy: -1405.99228144 hartree
totalentropycorr: -0.06555498 hartree
gibbsenthalpy: -1406.05783642 hartree
gibbsminuselec: 0.26229137 hartree
chargesum: 1.0000000
charge: -0.171407 0.178174 -0.079203 0.140913 0.317736 -0.343483 0.172802 0.008680 -0.339180 -0.115090 0.133682 -0.177783 0.189870 0.129980 0.125551 -0.252688 0.236602 0.144123 -0.161275 0.127332 0.323616 -0.414465 -0.175466 0.077026 0.143271 -0.189676 0.120478 0.135988 -0.021905 0.153322 -0.077698 0.229801 0.213940 0.280206 -0.255568 -0.286334 0.251808 0.226319
charge: 0.331404 -0.035568 -0.038664 0.045028 -0.431495 0.104665 -0.399697 -0.128614 0.107899 0.371616 0.053311 -0.232988 0.002999 0.007112 0.012323 0.380597 -0.082773 0.038923 0.505126 -0.140587 -0.315128 0.142970 -0.009897 0.017563 0.041047 0.003284 0.031896 0.035717 -0.057225 0.045291 0.587752 -0.072995 0.032765 -0.438267 0.159597 0.364854 -0.071230 0.031388
qa: -0.1714 0.1782 -0.0792 0.1409 0.3177 -0.3435 0.1728 0.0087 -0.3392 -0.1151 0.1337 -0.1778 0.1899 0.1300 0.1256 -0.2527 0.2366 0.1441 -0.1613 0.1273 0.3236 -0.4145 -0.1755 0.0770 0.1433 -0.1897 0.1205 0.1360 -0.0219 0.1533 -0.0777 0.2298 0.2139 0.2802 -0.2556 -0.2863 0.2518 0.2263
va: 3.1885 1.0331 3.8213 1.0197 4.2715 2.1247 4.3106 3.8695 2.1914 3.2219 0.9916 3.9843 1.0145 1.0018 1.0098 2.2354 1.0199 1.0060 2.1746 1.0169 4.1478 2.0993 3.9124 1.0608 1.0158 3.8038 1.0474 1.0051 3.8459 1.0025 3.5179 1.0984 0.9844 4.3895 2.2434 2.2050 1.0113 0.9905
dispcorr: -0.083810184 hartree
energy: -1406.325402948608
dipole: 2.19862 -0.39286 1.80576 0.80709 0.40216 1.20925 -1.13926 0.33210 -0.80716
magnitude: 2.31831 au
magnitude: 5.89268 debye
zeropoint: 0.31011552 hartree
thermalvibcorrection: 0.01832917 hartree
thermalrotcorrection: 0.00141627 hartree
thermaltrasncorrection: 0.00141627 hartree
thermaltotal: -1405.99412572 hartree
thermalcorr: 0.02116171 hartree
nonthermalcorr: 0.31011552 hartree
totalcorr: 0.33127723 hartree
totalenthalpy: -1405.99318151 hartree
