program: Orca
programVersion: 5.0.2
elementType: N H C H C O C C O N H C H H H O H H S H C O C H H C H H C H N H H C O O H H
charge: 1
multiplicity: 1
keywords: wB97X-D3BJ Opt Freq def2-TZVPP def2/J RIJCOSX VeryTightSCF
keywords: PAL8 defgrid3 TightOpt
frequency: 0.00 0.00 0.00 0.00 0.00 0.00 34.26 46.95 62.27 68.51 86.01 94.23 96.34 125.29 132.99 138.66 158.56 166.97 190.17 203.55 214.68 227.51 235.57 243.36 284.21 302.54 321.27 336.51 352.43 353.81 428.07 444.91 461.62 513.80 519.81 598.12 600.50 608.27 615.27 631.84 641.77 680.87 693.78 727.24 770.09 786.82 807.77 832.92 849.54 872.24 900.30 905.87 916.58 943.80 954.08 978.00 1013.63 1048.93 1059.07 1069.65 1085.68 1104.43 1117.59 1148.71 1170.73 1212.87 1235.63 1245.59 1256.92 1268.74 1287.99 1327.01 1330.12 1342.34 1355.07 1360.36 1378.66 1387.25 1393.66 1411.40 1440.34 1450.28 1463.43 1483.03 1490.93 1491.74 1499.76 1507.13 1522.39 1580.43 1643.61 1683.22 1729.32 1795.59 1808.84 1881.35 2764.88 3048.29 3080.79 3089.15 3097.86 3112.45 3118.53 3144.58 3158.65 3160.43 3200.17 3239.22 3279.50 3479.48 3543.94 3613.91 3623.05 3785.06
frequency: 34.26 46.95 62.27 68.51 86.01 94.23 96.34 125.29 132.99 138.66 158.56 166.97 190.17 203.55 214.68 227.51 235.57 243.36 284.21 302.54 321.27 336.51 352.43 353.81 428.07 444.91 461.62 513.80 519.81 598.12 600.50 608.27 615.27 631.84 641.77 680.87 693.78 727.24 770.09 786.82 807.77 832.92 849.54 872.24 900.30 905.87 916.58 943.80 954.08 978.00 1013.63 1048.93 1059.07 1069.65 1085.68 1104.43 1117.59 1148.71 1170.73 1212.87 1235.63 1245.59 1256.92 1268.74 1287.99 1327.01 1330.12 1342.34 1355.07 1360.36 1378.66 1387.25 1393.66 1411.40 1440.34 1450.28 1463.43 1483.03 1490.93 1491.74 1499.76 1507.13 1522.39 1580.43 1643.61 1683.22 1729.32 1795.59 1808.84 1881.35 2764.88 3048.29 3080.79 3089.15 3097.86 3112.45 3118.53 3144.58 3158.65 3160.43 3200.17 3239.22 3279.50 3479.48 3543.94 3613.91 3623.05 3785.06
formula: C10H18N3O6S
InChI: InChI=1S/C10H18N3O6S/c11-5(10(18)19)1-2-7(14)13-6(4-20)9(17)12-3-8(15)16/h5-6,12-13,15,18,20H,1-4H2,11H3
38 atoms
N  -0.877022 -1.036385 -2.47553
H  -0.505023 -0.103148 -2.377062
C  -1.025375 -1.575623 -3.82214
H  -1.918233 -2.201212 -3.868977
C  0.212686 -2.39426 -4.174896
O  1.064488 -2.010759 -4.953654
C  -1.010579 -1.811382 -1.382885
C  -0.889199 -1.120915 -0.019644
O  -1.227221 -3.019964 -1.456347
N  0.001043 0.025269 -0.042341
H  -0.529954 -1.882664 0.673996
C  -2.290391 -0.697861 0.425823
H  -0.402063 0.939091 0.111348
H  -2.6989 0.031828 -0.276166
H  -2.928458 -1.580064 0.430513
O  0.386747 -3.509398 -3.484206
H  -0.324902 -3.600221 -2.798894
H  -1.112972 -0.752761 -4.525522
S  -2.176041 0.016027 2.089336
H  -3.485291 0.242911 2.238286
C  1.367302 0.015802 -0.047028
O  2.011656 1.044316 -0.064467
C  2.09148 -1.326644 -0.054038
H  2.518538 -1.449476 0.943435
H  1.429018 -2.175477 -0.228552
C  3.217302 -1.325433 -1.09283
H  3.760418 -2.271747 -1.019544
H  3.919323 -0.51596 -0.895361
C  2.609226 -1.202159 -2.494567
H  1.633778 -1.6691 -2.483442
N  3.382682 -1.938235 -3.554419
H  4.192441 -1.398828 -3.864181
H  3.699449 -2.843851 -3.210125
C  2.426239 0.238595 -2.972314
O  1.372563 0.80071 -3.037038
O  3.604487 0.764285 -3.325088
H  3.479274 1.68812 -3.586888
H  2.722554 -2.104066 -4.350697
totalener: -1406.22581026 hartree
nucrepener: 1957.68446518 hartree
electener: -3363.91027544 hartree
oneelecener: -5797.81644550 hartree
twoeener: 2433.90617006 hartree
kineticenergy: 1400.64028560 hartree
exchangeener: -105.322340022476 hartree
correlationener: -7.060586285089 hartree
xcener: -112.382926307564 hartree
temp: 298.15 k
press: 1.00 atm
thermalcorrenthalpy: 0.00094421 hartree
totalenthalpy: -1405.98284620 hartree
totalentropycorr: -0.06443468 hartree
gibbsenthalpy: -1406.04728088 hartree
gibbsminuselec: 0.26447653 hartree
chargesum: 1.0000000
charge: -0.211412 0.220706 -0.150597 0.167707 0.340539 -0.354790 0.223566 0.061558 -0.382729 -0.209908 0.151080 -0.224691 0.203494 0.124255 0.144538 -0.255503 0.254936 0.148965 -0.127583 0.121519 0.159658 -0.316092 -0.161079 0.149697 0.087537 -0.175772 0.095309 0.151438 0.065239 0.046640 -0.042077 0.234139 0.228103 0.292378 -0.285907 -0.276073 0.258267 0.242947
charge: 0.342553 -0.031256 -0.025010 0.040740 -0.437069 0.127814 -0.376275 -0.155845 0.119378 0.327019 0.041027 -0.226584 -0.011457 0.004778 0.016791 0.376575 -0.135107 0.042823 0.485618 -0.140030 -0.391050 0.106272 0.003192 0.047831 0.024110 0.008082 0.028425 0.040852 -0.048049 0.028348 0.614693 0.046741 0.049569 -0.435229 0.167566 0.381667 -0.061243 0.001734
qa: -0.2114 0.2207 -0.1506 0.1677 0.3405 -0.3548 0.2236 0.0616 -0.3827 -0.2099 0.1511 -0.2247 0.2035 0.1243 0.1445 -0.2555 0.2549 0.1490 -0.1276 0.1215 0.1597 -0.3161 -0.1611 0.1497 0.0875 -0.1758 0.0953 0.1514 0.0652 0.0466 -0.0421 0.2341 0.2281 0.2924 -0.2859 -0.2761 0.2583 0.2429
va: 3.1489 1.0181 3.8772 0.9964 4.1667 2.1482 4.1339 3.7798 2.1412 3.0341 1.0106 4.0695 1.0175 0.9977 1.0025 2.2249 1.0630 1.0098 2.1757 1.0206 4.3519 2.2055 3.7862 1.0043 1.0313 3.9822 1.0117 1.0186 3.8863 1.0762 3.5957 0.9887 0.9806 4.3080 2.1646 2.2411 1.0053 1.0521
dispcorr: -0.086095450 hartree
energy: -1406.317902978983
dipole: 3.17963 -1.21772 1.96191 -4.34622 3.42387 -0.92235 -0.31999 -1.50947 -1.82946
magnitude: 2.83668 au
magnitude: 7.21027 debye
zeropoint: 0.31161658 hartree
thermalvibcorrection: 0.01803018 hartree
thermalrotcorrection: 0.00141627 hartree
thermaltrasncorrection: 0.00141627 hartree
thermaltotal: -1405.98542368 hartree
thermalcorr: 0.02086272 hartree
nonthermalcorr: 0.31161658 hartree
totalcorr: 0.33247930 hartree
totalenthalpy: -1405.98447947 hartree
