program: Orca
programVersion: 5.0.2
elementType: N H C H C O C C O N H C H H H O H H S H C O C H H C H H C H N H H C O O H H
charge: 1
multiplicity: 1
keywords: wB97X-D3BJ Opt Freq def2-TZVPP def2/J RIJCOSX VeryTightSCF
keywords: PAL8 defgrid3 TightOpt
frequency: 0.00 0.00 0.00 0.00 0.00 0.00 27.50 31.08 42.94 56.14 63.19 69.79 75.36 103.35 110.93 125.14 146.03 160.99 180.61 201.08 218.37 226.01 238.41 245.85 266.69 287.78 297.17 324.40 334.90 361.39 407.29 460.01 484.44 506.35 512.99 519.64 531.81 553.11 601.65 617.53 634.60 661.50 667.13 675.38 715.15 746.93 767.67 795.51 814.62 830.30 862.97 867.22 905.35 924.74 974.62 985.52 1018.25 1055.39 1063.65 1097.06 1119.52 1139.17 1149.46 1170.61 1170.99 1204.94 1212.79 1220.36 1247.20 1263.76 1285.30 1305.53 1316.91 1333.69 1339.14 1352.85 1356.15 1375.41 1384.36 1415.46 1452.14 1454.95 1470.16 1471.67 1491.00 1496.59 1497.95 1505.49 1563.46 1591.72 1644.96 1670.33 1744.42 1789.60 1824.18 1843.06 2760.57 3078.80 3086.81 3097.92 3098.91 3141.37 3148.44 3151.87 3161.68 3167.46 3171.13 3307.94 3356.07 3422.54 3623.17 3689.54 3787.96 3794.89
frequency: 27.50 31.08 42.94 56.14 63.19 69.79 75.36 103.35 110.93 125.14 146.03 160.99 180.61 201.08 218.37 226.01 238.41 245.85 266.69 287.78 297.17 324.40 334.90 361.39 407.29 460.01 484.44 506.35 512.99 519.64 531.81 553.11 601.65 617.53 634.60 661.50 667.13 675.38 715.15 746.93 767.67 795.51 814.62 830.30 862.97 867.22 905.35 924.74 974.62 985.52 1018.25 1055.39 1063.65 1097.06 1119.52 1139.17 1149.46 1170.61 1170.99 1204.94 1212.79 1220.36 1247.20 1263.76 1285.30 1305.53 1316.91 1333.69 1339.14 1352.85 1356.15 1375.41 1384.36 1415.46 1452.14 1454.95 1470.16 1471.67 1491.00 1496.59 1497.95 1505.49 1563.46 1591.72 1644.96 1670.33 1744.42 1789.60 1824.18 1843.06 2760.57 3078.80 3086.81 3097.92 3098.91 3141.37 3148.44 3151.87 3161.68 3167.46 3171.13 3307.94 3356.07 3422.54 3623.17 3689.54 3787.96 3794.89
formula: C10H18N3O6S
InChI: InChI=1S/C10H18N3O6S/c11-5(10(18)19)1-2-7(14)13-6(4-20)9(17)12-3-8(15)16/h5-6,12-13,15,18,20H,1-4H2,11H3
38 atoms
N  -1.581202 -0.583855 -2.74323
H  -2.185588 0.102202 -2.327113
C  -1.56865 -0.703748 -4.180553
H  -1.576404 -1.758591 -4.467163
C  -0.348502 -0.083537 -4.839351
O  0.678567 0.22025 -4.27621
C  -0.796369 -1.341009 -1.953808
C  -0.857175 -1.08355 -0.440331
O  -0.0144 -2.164248 -2.422109
N  0.045737 0.008925 -0.112168
H  -0.508373 -2.002383 0.026038
C  -2.251668 -0.791528 0.106412
H  -0.324214 0.948356 -0.129364
H  -2.16869 -0.658034 1.185573
H  -2.666454 0.141429 -0.283981
O  -0.544309 0.057232 -6.144135
H  0.25087 0.42939 -6.550663
H  -2.465155 -0.245461 -4.595325
S  -3.407141 -2.158682 -0.126398
H  -3.59269 -2.008113 -1.442338
C  1.410808 -0.028469 -0.033234
O  2.056674 0.998736 0.035905
C  2.097042 -1.386749 -0.011065
H  2.197641 -1.675132 1.038703
H  1.49325 -2.159445 -0.483018
C  3.492633 -1.316634 -0.632956
H  3.926749 -2.319598 -0.664401
H  4.140682 -0.69309 -0.019078
C  3.504209 -0.695767 -2.032314
H  3.187987 0.344595 -1.964516
N  2.596122 -1.40384 -2.988958
H  2.129219 -0.740338 -3.620356
H  3.17144 -2.042274 -3.549932
C  4.891222 -0.774906 -2.654646
O  5.131844 -1.476461 -3.604817
O  5.766539 -0.015345 -2.014985
H  6.636073 -0.116381 -2.428561
H  1.81472 -1.906734 -2.542993
totalener: -1406.24773987 hartree
nucrepener: 1877.07164209 hartree
electener: -3283.31938196 hartree
oneelecener: -5637.65479537 hartree
twoeener: 2354.33541341 hartree
kineticenergy: 1400.66742428 hartree
exchangeener: -105.327148714701 hartree
correlationener: -7.052233839229 hartree
xcener: -112.379382553930 hartree
temp: 298.15 k
press: 1.00 atm
thermalcorrenthalpy: 0.00094421 hartree
totalenthalpy: -1405.99846211 hartree
totalentropycorr: -0.06608555 hartree
gibbsenthalpy: -1406.06454766 hartree
gibbsminuselec: 0.26352177 hartree
chargesum: 1.0000000
charge: -0.178621 0.190589 -0.095215 0.148185 0.343805 -0.387673 0.278443 -0.006351 -0.448552 -0.169757 0.133879 -0.174689 0.178300 0.146299 0.102937 -0.229401 0.246354 0.153999 -0.096277 0.092681 0.218439 -0.333703 -0.208754 0.140666 0.085870 -0.195522 0.127492 0.147486 0.004304 0.167038 -0.074342 0.242074 0.217732 0.285191 -0.308282 -0.232157 0.251670 0.235863
charge: 0.344891 -0.019366 -0.033050 0.048906 -0.413859 0.105283 -0.363755 -0.154565 0.083084 0.329962 0.041686 -0.250441 -0.012518 0.023385 -0.002413 0.402156 -0.071490 0.043389 0.514608 -0.157472 -0.382194 0.100531 -0.008864 0.047070 0.013531 0.003889 0.034582 0.047559 -0.048412 0.045018 0.614131 0.005342 0.030762 -0.433429 0.129272 0.409086 -0.064532 -0.001761
qa: -0.1786 0.1906 -0.0952 0.1482 0.3438 -0.3877 0.2784 -0.0064 -0.4486 -0.1698 0.1339 -0.1747 0.1783 0.1463 0.1029 -0.2294 0.2464 0.1540 -0.0963 0.0927 0.2184 -0.3337 -0.2088 0.1407 0.0859 -0.1955 0.1275 0.1475 0.0043 0.1670 -0.0743 0.2421 0.2177 0.2852 -0.3083 -0.2322 0.2517 0.2359
va: 3.1901 1.0063 3.8016 1.0103 4.2560 2.0893 4.1047 3.8714 2.0468 3.0882 1.0128 3.9997 1.0279 1.0027 1.0038 2.2761 1.0125 1.0061 2.1660 1.0342 4.3003 2.1856 3.8057 1.0085 1.0382 3.9009 1.0057 1.0200 3.7725 1.0299 3.6022 1.0274 1.0172 4.3735 2.1850 2.2832 1.0067 1.0336
dispcorr: -0.080412421 hartree
energy: -1406.334275301414
dipole: -0.46268 0.64777 0.18508 -1.57465 1.67541 0.10076 2.69258 -4.02756 -1.33499
magnitude: 1.35152 au
magnitude: 3.43528 debye
zeropoint: 0.31068697 hartree
thermalvibcorrection: 0.01878572 hartree
thermalrotcorrection: 0.00141627 hartree
thermaltrasncorrection: 0.00141627 hartree
thermaltotal: -1406.00197007 hartree
thermalcorr: 0.02161826 hartree
nonthermalcorr: 0.31068697 hartree
totalcorr: 0.33230523 hartree
totalenthalpy: -1406.00102586 hartree
