program: Orca
programVersion: 5.0.2
elementType: N H C H C O C C O N H C H H H O H H S H C O C H H C H H C H N H H C O O H H
charge: 1
multiplicity: 1
keywords: wB97X-D3BJ Opt Freq def2-TZVPP def2/J RIJCOSX VeryTightSCF
keywords: PAL8 defgrid3 TightOpt
frequency: 0.00 0.00 0.00 0.00 0.00 0.00 27.08 34.03 38.52 48.02 64.55 75.02 79.62 86.24 103.78 127.47 147.37 167.79 176.25 197.36 218.26 235.27 246.83 257.48 294.60 300.14 315.75 335.29 351.98 372.99 401.44 442.46 489.39 503.26 505.05 509.49 520.61 564.57 604.76 614.85 636.00 657.69 668.15 684.48 719.00 727.72 752.21 772.13 808.94 833.32 865.53 885.56 914.46 917.94 956.23 977.57 990.66 1058.53 1060.00 1087.69 1102.13 1115.24 1116.30 1158.21 1184.78 1190.94 1202.37 1251.40 1257.74 1279.60 1286.40 1308.10 1319.24 1322.98 1346.67 1350.44 1356.99 1364.34 1415.24 1418.79 1434.03 1451.43 1455.94 1471.22 1481.47 1486.97 1496.02 1507.64 1573.12 1588.69 1667.79 1675.64 1748.34 1784.55 1823.96 1898.33 2746.92 3044.18 3090.29 3097.10 3097.81 3101.57 3122.59 3146.26 3154.17 3167.58 3174.83 3196.41 3398.29 3524.83 3622.13 3678.31 3794.32 3797.54
frequency: 27.08 34.03 38.52 48.02 64.55 75.02 79.62 86.24 103.78 127.47 147.37 167.79 176.25 197.36 218.26 235.27 246.83 257.48 294.60 300.14 315.75 335.29 351.98 372.99 401.44 442.46 489.39 503.26 505.05 509.49 520.61 564.57 604.76 614.85 636.00 657.69 668.15 684.48 719.00 727.72 752.21 772.13 808.94 833.32 865.53 885.56 914.46 917.94 956.23 977.57 990.66 1058.53 1060.00 1087.69 1102.13 1115.24 1116.30 1158.21 1184.78 1190.94 1202.37 1251.40 1257.74 1279.60 1286.40 1308.10 1319.24 1322.98 1346.67 1350.44 1356.99 1364.34 1415.24 1418.79 1434.03 1451.43 1455.94 1471.22 1481.47 1486.97 1496.02 1507.64 1573.12 1588.69 1667.79 1675.64 1748.34 1784.55 1823.96 1898.33 2746.92 3044.18 3090.29 3097.10 3097.81 3101.57 3122.59 3146.26 3154.17 3167.58 3174.83 3196.41 3398.29 3524.83 3622.13 3678.31 3794.32 3797.54
formula: C10H18N3O6S
InChI: InChI=1S/C10H18N3O6S/c11-5(10(18)19)1-2-7(14)13-6(4-20)9(17)12-3-8(15)16/h5-6,12-13,15,18,20H,1-4H2,11H3
38 atoms
N  -2.222457 -2.760997 -0.096412
H  -2.523144 -2.153078 0.645945
C  -2.62429 -4.145594 -0.061492
H  -3.470185 -4.266634 0.61365
C  -1.513414 -5.08992 0.36628
O  -0.338432 -4.808974 0.435025
C  -1.439017 -2.267197 -1.073397
C  -1.181407 -0.754969 -1.010884
O  -0.995839 -2.974821 -1.971631
N  0.059514 -0.407978 -1.64599
H  -1.19165 -0.436732 0.038636
C  -2.355595 -0.078822 -1.742968
H  0.022032 0.253827 -2.407412
H  -2.430133 -0.492154 -2.751172
H  -3.28682 -0.305297 -1.225096
O  -2.003433 -6.29431 0.632097
H  -1.283028 -6.886236 0.889652
H  -2.948491 -4.468993 -1.053729
S  -2.17644 1.701033 -1.971991
H  -2.143368 2.031083 -0.674647
C  1.306508 -0.853177 -1.336999
O  2.267725 -0.565532 -2.0262
C  1.474198 -1.712686 -0.091269
H  1.614207 -1.027037 0.74904
H  0.583977 -2.295568 0.1445
C  2.697788 -2.623835 -0.18837
H  2.72809 -3.287716 0.679051
H  3.611805 -2.033716 -0.174783
C  2.743662 -3.446581 -1.470447
H  2.874496 -2.776019 -2.322388
N  1.459782 -4.189844 -1.703426
H  1.122229 -4.64894 -0.849777
H  0.677486 -3.570321 -1.98745
C  3.920013 -4.414175 -1.47645
O  4.960864 -4.197654 -0.937752
O  3.647031 -5.522248 -2.20009
H  4.440188 -6.075792 -2.222408
H  1.593699 -4.900504 -2.421903
totalener: -1406.23846322 hartree
nucrepener: 1867.56032052 hartree
electener: -3273.79878373 hartree
oneelecener: -5618.10799285 hartree
twoeener: 2344.30920912 hartree
kineticenergy: 1401.48114095 hartree
exchangeener: -105.473554911356 hartree
correlationener: -7.063427577222 hartree
xcener: -112.536982488578 hartree
temp: 298.15 k
press: 1.00 atm
thermalcorrenthalpy: 0.00094421 hartree
totalenthalpy: -1405.98653148 hartree
totalentropycorr: -0.07111624 hartree
gibbsenthalpy: -1406.05764773 hartree
gibbsminuselec: 0.26176674 hartree
chargesum: 1.0000000
charge: -0.172380 0.190808 -0.081594 0.155470 0.341579 -0.392015 0.246748 0.019463 -0.424785 -0.149602 0.118321 -0.200806 0.183910 0.153220 0.117223 -0.229848 0.245019 0.147216 -0.102606 0.098882 0.185444 -0.340998 -0.172873 0.138164 0.071655 -0.185829 0.122397 0.149261 -0.017408 0.174061 -0.067858 0.232104 0.241633 0.271485 -0.239936 -0.299942 0.251159 0.223262
charge: 0.346664 -0.012182 -0.031165 0.044240 -0.417832 0.095112 -0.375414 -0.157175 0.098989 0.333773 0.028288 -0.243974 -0.017507 0.021772 0.006757 0.402143 -0.072472 0.048696 0.513285 -0.145848 -0.387335 0.096079 -0.008042 0.044948 0.015510 0.004748 0.034684 0.051168 -0.050110 0.048034 0.609697 0.018508 -0.005784 -0.426345 0.174287 0.349485 -0.071501 0.035816
qa: -0.1724 0.1908 -0.0816 0.1555 0.3416 -0.3920 0.2467 0.0195 -0.4248 -0.1496 0.1183 -0.2008 0.1839 0.1532 0.1172 -0.2298 0.2450 0.1472 -0.1026 0.0989 0.1854 -0.3410 -0.1729 0.1382 0.0717 -0.1858 0.1224 0.1493 -0.0174 0.1741 -0.0679 0.2321 0.2416 0.2715 -0.2399 -0.2999 0.2512 0.2233
va: 3.2073 1.0053 3.8051 1.0065 4.2343 2.0690 4.1395 3.8420 2.0843 3.1186 0.9960 3.9659 1.0390 0.9974 1.0087 2.2784 1.0137 1.0111 2.1804 1.0246 4.3154 2.1725 3.7713 1.0097 1.0398 3.9433 1.0094 1.0196 3.7407 1.0272 3.6001 1.0223 1.0450 4.3787 2.2624 2.1766 1.0115 0.9960
dispcorr: -0.080942630 hartree
energy: -1406.333108701053
dipole: -4.09247 2.39127 -1.70120 -1.34584 -1.22553 -2.57137 4.11755 -2.91729 1.20026
magnitude: 3.30857 au
magnitude: 8.40972 debye
zeropoint: 0.31046772 hartree
thermalvibcorrection: 0.01872151 hartree
thermalrotcorrection: 0.00141627 hartree
thermaltrasncorrection: 0.00141627 hartree
thermaltotal: -1406.00108693 hartree
thermalcorr: 0.02155405 hartree
nonthermalcorr: 0.31046772 hartree
totalcorr: 0.33202177 hartree
totalenthalpy: -1406.00014272 hartree
