program: Orca
programVersion: 5.0.2
elementType: N H C H C O C C O N H C H H H O H H S H C O C H H C H H C H N H H C O O H H
charge: 1
multiplicity: 1
keywords: wB97X-D3BJ Opt Freq def2-TZVPP def2/J RIJCOSX VeryTightSCF
keywords: PAL8 defgrid3 TightOpt
frequency: 0.00 0.00 0.00 0.00 0.00 0.00 16.66 23.74 31.54 44.18 47.45 54.89 63.75 75.17 96.21 112.61 126.78 147.31 178.36 180.91 195.50 213.23 251.53 263.57 276.27 292.10 312.59 323.20 327.16 395.24 454.36 466.74 502.03 515.35 528.06 540.38 545.54 574.59 593.22 641.78 644.85 652.56 662.07 672.51 722.61 757.42 776.36 794.54 812.26 827.94 836.56 892.67 914.13 942.33 974.66 1011.47 1026.00 1038.94 1051.59 1099.79 1117.67 1126.76 1153.30 1157.28 1179.44 1202.63 1206.76 1224.09 1229.71 1249.73 1282.17 1285.55 1302.09 1322.81 1331.17 1346.10 1354.87 1363.78 1367.79 1400.41 1417.59 1439.30 1467.26 1492.47 1493.03 1499.81 1502.43 1508.80 1581.33 1616.49 1677.48 1680.77 1705.80 1812.54 1852.06 1902.33 2714.47 2756.05 3091.44 3096.54 3102.17 3109.52 3136.09 3138.83 3144.08 3151.86 3159.39 3169.94 3486.71 3555.21 3609.42 3622.85 3786.93 3795.91
frequency: 16.66 23.74 31.54 44.18 47.45 54.89 63.75 75.17 96.21 112.61 126.78 147.31 178.36 180.91 195.50 213.23 251.53 263.57 276.27 292.10 312.59 323.20 327.16 395.24 454.36 466.74 502.03 515.35 528.06 540.38 545.54 574.59 593.22 641.78 644.85 652.56 662.07 672.51 722.61 757.42 776.36 794.54 812.26 827.94 836.56 892.67 914.13 942.33 974.66 1011.47 1026.00 1038.94 1051.59 1099.79 1117.67 1126.76 1153.30 1157.28 1179.44 1202.63 1206.76 1224.09 1229.71 1249.73 1282.17 1285.55 1302.09 1322.81 1331.17 1346.10 1354.87 1363.78 1367.79 1400.41 1417.59 1439.30 1467.26 1492.47 1493.03 1499.81 1502.43 1508.80 1581.33 1616.49 1677.48 1680.77 1705.80 1812.54 1852.06 1902.33 2714.47 2756.05 3091.44 3096.54 3102.17 3109.52 3136.09 3138.83 3144.08 3151.86 3159.39 3169.94 3486.71 3555.21 3609.42 3622.85 3786.93 3795.91
formula: C10H18N3O6S
InChI: InChI=1S/C10H18N3O6S/c11-5(10(18)19)1-2-7(14)13-6(4-20)9(17)12-3-8(15)16/h5-6,12-13,15,18,20H,1-4H2,11H3
38 atoms
N  -2.07231 -0.803507 -2.240573
H  -2.65529 -0.08845 -1.828673
C  -2.347146 -1.072915 -3.634569
H  -1.471268 -0.891117 -4.260637
C  -3.471069 -0.150078 -4.060771
O  -3.99446 0.639617 -3.319032
C  -1.208785 -1.500757 -1.518304
C  -1.018717 -1.09346 -0.049317
O  -0.531383 -2.411261 -2.024916
N  -0.073941 0.003265 0.05406
H  -0.612875 -1.973437 0.447058
C  -2.322719 -0.729521 0.659251
H  -0.445216 0.942399 0.060225
H  -2.109856 -0.493181 1.700531
H  -2.777816 0.165345 0.227572
O  -3.79206 -0.328345 -5.339657
H  -4.511734 0.278142 -5.563996
H  -2.651357 -2.110988 -3.783243
S  -3.562373 -2.040349 0.548966
H  -3.056759 -2.812912 1.517077
C  1.298735 -0.030234 0.026269
O  1.947789 0.990559 0.042502
C  1.98838 -1.380334 -0.078929
H  2.817501 -1.367781 0.62935
H  1.324123 -2.198988 0.197474
C  2.519333 -1.541579 -1.510452
H  3.409441 -0.927725 -1.642471
H  1.77994 -1.199558 -2.23647
C  2.882677 -2.983837 -1.858642
H  3.255195 -3.026346 -2.881687
N  1.660441 -3.864683 -1.779865
H  1.680084 -4.406535 -0.915589
H  0.766999 -3.285835 -1.807615
C  3.999871 -3.494501 -0.954572
O  5.09497 -3.026376 -0.964558
O  3.592417 -4.493166 -0.143126
H  4.336132 -4.761475 0.415447
H  1.633833 -4.53124 -2.548217
totalener: -1406.23267443 hartree
nucrepener: 1802.69348480 hartree
electener: -3208.92615922 hartree
oneelecener: -5488.98567668 hartree
twoeener: 2280.05951745 hartree
kineticenergy: 1400.63325406 hartree
exchangeener: -105.318546054847 hartree
correlationener: -7.049364886054 hartree
xcener: -112.367910940901 hartree
temp: 298.15 k
press: 1.00 atm
thermalcorrenthalpy: 0.00094421 hartree
totalenthalpy: -1405.98166196 hartree
totalentropycorr: -0.06694244 hartree
gibbsenthalpy: -1406.04860440 hartree
gibbsminuselec: 0.26173544 hartree
chargesum: 1.0000000
charge: -0.132160 0.184638 -0.077220 0.127665 0.306537 -0.316768 0.329911 -0.028362 -0.475705 -0.173170 0.108458 -0.172291 0.185846 0.148362 0.118975 -0.252452 0.248804 0.134172 -0.113998 0.105186 0.175032 -0.306794 -0.156240 0.155582 0.061097 -0.221152 0.164678 0.123676 -0.010699 0.159793 -0.060400 0.214931 0.213580 0.269636 -0.228377 -0.293931 0.254600 0.228557
charge: 0.364774 -0.020562 -0.022829 0.036827 -0.432983 0.121735 -0.351142 -0.159210 0.108765 0.328134 0.029478 -0.243159 -0.009483 0.016234 0.008252 0.386880 -0.071994 0.040257 0.507964 -0.146194 -0.382024 0.116240 -0.006423 0.042731 0.006216 0.003792 0.052061 0.031137 -0.043906 0.049523 0.601323 0.024307 -0.064435 -0.434490 0.180151 0.355510 -0.066695 0.043239
qa: -0.1322 0.1846 -0.0772 0.1277 0.3065 -0.3168 0.3299 -0.0284 -0.4757 -0.1732 0.1085 -0.1723 0.1858 0.1484 0.1190 -0.2525 0.2488 0.1342 -0.1140 0.1052 0.1750 -0.3068 -0.1562 0.1556 0.0611 -0.2212 0.1647 0.1237 -0.0107 0.1598 -0.0604 0.2149 0.2136 0.2696 -0.2284 -0.2939 0.2546 0.2286
va: 3.2505 1.0452 3.8698 1.0068 4.3327 2.1724 4.0190 3.9791 2.0239 3.0727 1.0083 3.9827 1.0231 1.0021 1.0037 2.2489 1.0094 1.0068 2.1729 1.0229 4.3825 2.2237 3.7697 1.0286 1.0210 3.8977 1.0183 1.0190 3.8204 0.9980 3.5483 1.0080 1.1106 4.3462 2.2795 2.1719 1.0073 0.9776
dispcorr: -0.078229594 hartree
energy: -1406.316590443098
dipole: 3.84713 -3.29366 0.55347 -4.92443 1.75053 -3.17389 1.13423 -1.81214 -0.67791
magnitude: 3.29234 au
magnitude: 8.36846 debye
zeropoint: 0.30984058 hartree
thermalvibcorrection: 0.01898579 hartree
thermalrotcorrection: 0.00141627 hartree
thermaltrasncorrection: 0.00141627 hartree
thermaltotal: -1405.98493152 hartree
thermalcorr: 0.02181834 hartree
nonthermalcorr: 0.30984058 hartree
totalcorr: 0.33165892 hartree
totalenthalpy: -1405.98398731 hartree
