program: Orca
programVersion: 5.0.2
elementType: N H C H C O C C O N H C H H H O H H S H C O C H H C H H C H N H H C O O H H
charge: 1
multiplicity: 1
keywords: wB97X-D3BJ Opt Freq def2-TZVPP def2/J RIJCOSX VeryTightSCF
keywords: PAL8 defgrid3 TightOpt
frequency: 0.00 0.00 0.00 0.00 0.00 0.00 29.18 58.46 75.63 87.83 91.91 107.77 113.99 115.69 140.33 152.19 162.62 172.69 200.81 219.19 253.56 260.95 275.07 277.80 291.97 297.49 325.81 346.54 360.86 385.07 397.58 443.25 472.06 522.34 539.86 565.13 571.80 592.56 616.26 625.94 656.17 688.84 697.29 703.26 735.72 749.87 778.87 788.52 823.90 837.72 856.31 888.84 917.34 925.13 927.77 1020.22 1023.14 1030.01 1063.59 1095.47 1102.11 1117.78 1132.26 1181.01 1194.79 1212.47 1220.28 1225.58 1247.60 1293.23 1297.94 1303.61 1314.56 1337.77 1355.23 1371.83 1394.68 1396.46 1405.88 1421.43 1436.30 1442.70 1458.10 1480.10 1481.99 1490.70 1491.84 1501.83 1550.75 1604.49 1611.97 1694.34 1730.26 1760.17 1827.06 1867.83 2754.78 3090.09 3094.98 3101.71 3108.01 3117.03 3119.78 3157.08 3158.15 3176.22 3178.14 3216.74 3370.09 3519.26 3557.61 3620.20 3622.15 3795.53
frequency: 29.18 58.46 75.63 87.83 91.91 107.77 113.99 115.69 140.33 152.19 162.62 172.69 200.81 219.19 253.56 260.95 275.07 277.80 291.97 297.49 325.81 346.54 360.86 385.07 397.58 443.25 472.06 522.34 539.86 565.13 571.80 592.56 616.26 625.94 656.17 688.84 697.29 703.26 735.72 749.87 778.87 788.52 823.90 837.72 856.31 888.84 917.34 925.13 927.77 1020.22 1023.14 1030.01 1063.59 1095.47 1102.11 1117.78 1132.26 1181.01 1194.79 1212.47 1220.28 1225.58 1247.60 1293.23 1297.94 1303.61 1314.56 1337.77 1355.23 1371.83 1394.68 1396.46 1405.88 1421.43 1436.30 1442.70 1458.10 1480.10 1481.99 1490.70 1491.84 1501.83 1550.75 1604.49 1611.97 1694.34 1730.26 1760.17 1827.06 1867.83 2754.78 3090.09 3094.98 3101.71 3108.01 3117.03 3119.78 3157.08 3158.15 3176.22 3178.14 3216.74 3370.09 3519.26 3557.61 3620.20 3622.15 3795.53
formula: C10H18N3O6S
InChI: InChI=1S/C10H18N3O6S/c11-5(10(18)19)1-2-7(14)13-6(4-20)9(17)12-3-8(15)16/h5-6,12-13,15,18,20H,1-4H2,11H3
38 atoms
N  -0.842073 -2.826296 -2.182349
H  -1.532219 -3.27471 -1.599102
C  -0.391659 -3.488931 -3.393825
H  0.627705 -3.851308 -3.277908
C  -0.429292 -2.600711 -4.622942
O  0.491098 -2.491954 -5.396938
C  -0.403727 -1.617007 -1.825415
C  -0.849282 -1.1233 -0.437401
O  0.342937 -0.952166 -2.546815
N  -0.009665 -0.027326 -0.000138
H  -0.770736 -1.961094 0.259456
C  -2.306083 -0.631669 -0.432019
H  -0.409553 0.899242 -0.034632
H  -2.512128 -0.221413 0.557255
H  -2.439584 0.171507 -1.157417
O  -1.608137 -2.00331 -4.793521
H  -1.569107 -1.483787 -5.608654
H  -1.04969 -4.338568 -3.581262
S  -3.552029 -1.911719 -0.704718
H  -3.616325 -1.805339 -2.036915
C  1.347181 -0.016459 0.002832
O  1.959078 1.046517 0.019309
C  2.091604 -1.340896 0.013252
H  2.208655 -1.610089 1.067292
H  1.531744 -2.149636 -0.45009
C  3.485031 -1.225706 -0.606759
H  4.011934 -2.168705 -0.461113
H  4.048643 -0.452269 -0.083585
C  3.542279 -0.935354 -2.104051
H  4.584889 -0.791484 -2.394939
N  2.814808 0.335159 -2.468269
H  1.806455 0.117302 -2.567893
H  2.894154 1.018515 -1.704441
C  2.966671 -2.047734 -2.984933
O  2.717261 -3.149065 -2.580552
O  2.794517 -1.603486 -4.224989
H  2.2024 -2.193741 -4.738598
H  3.148053 0.708343 -3.353738
totalener: -1406.24979577 hartree
nucrepener: 1966.70270078 hartree
electener: -3372.95249655 hartree
oneelecener: -5816.48722860 hartree
twoeener: 2443.53473205 hartree
kineticenergy: 1400.67310075 hartree
exchangeener: -105.335027469107 hartree
correlationener: -7.062464292926 hartree
xcener: -112.397491762033 hartree
temp: 298.15 k
press: 1.00 atm
thermalcorrenthalpy: 0.00094421 hartree
totalenthalpy: -1406.00604540 hartree
totalentropycorr: -0.06377093 hartree
gibbsenthalpy: -1406.06981633 hartree
gibbsminuselec: 0.26598961 hartree
chargesum: 1.0000000
charge: -0.154688 0.188867 -0.122406 0.149749 0.351285 -0.341179 0.317594 -0.024758 -0.488092 -0.152089 0.146679 -0.192254 0.178578 0.156676 0.137203 -0.256095 0.243589 0.149972 -0.129964 0.116921 0.178179 -0.382366 -0.170163 0.146423 0.106031 -0.176487 0.132443 0.142488 -0.013868 0.167098 -0.066964 0.236536 0.232749 0.286184 -0.299591 -0.297625 0.268809 0.234537
charge: 0.352290 -0.032690 -0.022711 0.030890 -0.429189 0.134294 -0.373540 -0.146943 0.093579 0.337985 0.037200 -0.236939 -0.006832 0.019545 0.012789 0.383376 -0.074203 0.043775 0.522682 -0.144883 -0.373790 0.074868 0.001384 0.049279 0.026253 0.005801 0.046545 0.036588 -0.045315 0.047833 0.609200 -0.000582 0.023627 -0.454086 0.144051 0.374763 -0.109299 0.042407
qa: -0.1547 0.1889 -0.1224 0.1497 0.3513 -0.3412 0.3176 -0.0248 -0.4881 -0.1521 0.1467 -0.1923 0.1786 0.1567 0.1372 -0.2561 0.2436 0.1500 -0.1300 0.1169 0.1782 -0.3824 -0.1702 0.1464 0.1060 -0.1765 0.1324 0.1425 -0.0139 0.1671 -0.0670 0.2365 0.2327 0.2862 -0.2996 -0.2976 0.2688 0.2345
va: 3.2400 1.0410 3.8362 1.0294 4.2028 2.1390 3.9888 3.9265 1.9893 3.1417 0.9936 3.9389 1.0261 0.9961 1.0002 2.2353 1.0137 1.0016 2.1826 1.0230 4.3019 2.1046 3.7909 1.0020 1.0323 3.9122 1.0149 1.0098 3.8277 0.9955 3.6348 1.0394 1.0146 4.3776 2.1912 2.2161 1.0430 0.9779
dispcorr: -0.086151646 hartree
energy: -1406.341610032027
dipole: 4.70959 -4.22420 0.48538 2.56223 -1.70010 0.86213 5.03868 -5.18234 -0.14366
magnitude: 0.99975 au
magnitude: 2.54117 debye
zeropoint: 0.31227430 hartree
thermalvibcorrection: 0.01764719 hartree
thermalrotcorrection: 0.00141627 hartree
thermaltrasncorrection: 0.00141627 hartree
thermaltotal: -1406.00885600 hartree
thermalcorr: 0.02047973 hartree
nonthermalcorr: 0.31227430 hartree
totalcorr: 0.33275403 hartree
totalenthalpy: -1406.00791179 hartree
