program: Orca
programVersion: 5.0.2
elementType: N H C H C O C C O N H C H H H O H H S H C O C H H C H H C H N H H C O O H H
charge: 1
multiplicity: 1
keywords: wB97X-D3BJ Opt Freq def2-TZVPP def2/J RIJCOSX VeryTightSCF
keywords: PAL8 defgrid3 TightOpt
frequency: 0.00 0.00 0.00 0.00 0.00 0.00 17.34 27.97 34.01 40.21 60.10 64.92 78.48 86.49 99.71 102.62 122.07 147.75 181.67 198.77 223.90 245.65 272.08 304.19 318.87 326.47 353.96 372.11 383.91 390.24 417.87 460.96 507.30 509.47 520.30 522.65 599.07 605.18 623.98 652.48 661.75 668.81 690.11 707.53 745.48 751.20 798.88 818.25 822.49 843.49 861.96 885.50 911.46 925.46 957.44 1021.72 1025.47 1072.03 1074.95 1080.15 1118.76 1122.44 1146.12 1178.27 1184.95 1197.85 1207.69 1211.62 1251.52 1274.45 1293.35 1297.81 1305.58 1315.88 1337.29 1354.54 1357.71 1379.61 1389.19 1424.10 1449.70 1460.10 1461.55 1464.28 1472.77 1482.39 1492.93 1519.51 1550.56 1594.88 1639.92 1662.99 1716.68 1793.67 1842.29 1857.39 2161.33 2729.32 3077.00 3086.25 3106.62 3114.04 3119.81 3129.50 3146.48 3150.58 3163.45 3173.54 3440.46 3516.75 3556.88 3626.39 3784.10 3803.01
frequency: 17.34 27.97 34.01 40.21 60.10 64.92 78.48 86.49 99.71 102.62 122.07 147.75 181.67 198.77 223.90 245.65 272.08 304.19 318.87 326.47 353.96 372.11 383.91 390.24 417.87 460.96 507.30 509.47 520.30 522.65 599.07 605.18 623.98 652.48 661.75 668.81 690.11 707.53 745.48 751.20 798.88 818.25 822.49 843.49 861.96 885.50 911.46 925.46 957.44 1021.72 1025.47 1072.03 1074.95 1080.15 1118.76 1122.44 1146.12 1178.27 1184.95 1197.85 1207.69 1211.62 1251.52 1274.45 1293.35 1297.81 1305.58 1315.88 1337.29 1354.54 1357.71 1379.61 1389.19 1424.10 1449.70 1460.10 1461.55 1464.28 1472.77 1482.39 1492.93 1519.51 1550.56 1594.88 1639.92 1662.99 1716.68 1793.67 1842.29 1857.39 2161.33 2729.32 3077.00 3086.25 3106.62 3114.04 3119.81 3129.50 3146.48 3150.58 3163.45 3173.54 3440.46 3516.75 3556.88 3626.39 3784.10 3803.01
formula: C10H18N3O6S
InChI: InChI=1S/C10H18N3O6S/c11-5(10(18)19)1-2-7(14)13-6(4-20)9(17)12-3-8(15)16/h5-6,12-13,15,18,20H,1-4H2,11H3
38 atoms
N  -3.212454 -1.33539 -0.913851
H  -3.020685 -2.320848 -0.818339
C  -4.589337 -0.913601 -1.009345
H  -4.644694 0.07714 -1.458411
C  -5.253724 -0.865775 0.358254
O  -4.751393 -1.260202 1.379417
C  -2.30202 -0.479206 -0.403578
C  -0.950114 -1.093886 -0.009044
O  -2.503886 0.709966 -0.240409
N  -0.019744 0.023773 0.015224
H  -0.651903 -1.829126 -0.757987
C  -1.049107 -1.766802 1.372484
H  -0.47944 0.930273 0.063402
H  -0.043434 -1.997926 1.723428
H  -1.495196 -1.077242 2.088713
O  -6.478223 -0.343252 0.279245
H  -6.866673 -0.342067 1.16463
H  -5.146256 -1.601248 -1.64641
S  -1.952855 -3.33193 1.37812
H  -3.16453 -2.804408 1.601976
C  1.304661 0.0176 -0.021331
O  1.928206 1.099287 0.004657
C  2.046834 -1.304529 -0.076011
H  2.211733 -1.62956 0.956344
H  1.415188 -2.065783 -0.532441
C  3.380121 -1.262033 -0.836626
H  3.260445 -0.738549 -1.78946
H  3.658066 -2.289046 -1.075457
C  4.57009 -0.65751 -0.077053
H  4.635798 -1.08884 0.922677
N  4.441634 0.820084 0.04319
H  4.914443 1.246245 -0.759025
H  3.361657 1.057601 0.047241
C  5.870287 -0.929035 -0.829493
O  6.460338 -0.067886 -1.42478
O  6.224992 -2.20631 -0.756195
H  7.037929 -2.339549 -1.265341
H  4.896227 1.17657 0.879847
totalener: -1406.25482910 hartree
nucrepener: 1736.17379112 hartree
electener: -3142.42862022 hartree
oneelecener: -5357.19332797 hartree
twoeener: 2214.76470775 hartree
kineticenergy: 1400.65015023 hartree
exchangeener: -105.324705155746 hartree
correlationener: -7.053567418499 hartree
xcener: -112.378272574245 hartree
temp: 298.15 k
press: 1.00 atm
thermalcorrenthalpy: 0.00094421 hartree
totalenthalpy: -1406.00424597 hartree
totalentropycorr: -0.06608035 hartree
gibbsenthalpy: -1406.07032633 hartree
gibbsminuselec: 0.26131400 hartree
chargesum: 1.0000000
charge: -0.206969 0.171487 -0.071368 0.141044 0.324331 -0.349728 0.262930 -0.007056 -0.371728 -0.126542 0.121109 -0.168176 0.207905 0.112475 0.147135 -0.254778 0.241928 0.140884 -0.178922 0.156117 0.280379 -0.393303 -0.188261 0.113848 0.131218 -0.240883 0.138296 0.144125 0.021889 0.138864 -0.090206 0.218288 0.215578 0.278595 -0.289405 -0.246022 0.257306 0.217615
charge: 0.330133 -0.037770 -0.038243 0.043890 -0.432838 0.106219 -0.378345 -0.132930 0.104768 0.376544 0.024908 -0.243435 0.000483 0.002030 0.018901 0.383398 -0.078384 0.038347 0.495147 -0.144235 -0.327625 0.167726 -0.002878 0.038863 0.036587 0.005976 0.039723 0.043772 -0.060598 0.042656 0.585809 0.030144 -0.107249 -0.439021 0.140785 0.397169 -0.063635 0.033210
qa: -0.2070 0.1715 -0.0714 0.1410 0.3243 -0.3497 0.2629 -0.0071 -0.3717 -0.1265 0.1211 -0.1682 0.2079 0.1125 0.1471 -0.2548 0.2419 0.1409 -0.1789 0.1561 0.2804 -0.3933 -0.1883 0.1138 0.1312 -0.2409 0.1383 0.1441 0.0219 0.1389 -0.0902 0.2183 0.2156 0.2786 -0.2894 -0.2460 0.2573 0.2176
va: 3.2321 1.0536 3.8323 1.0193 4.2482 2.1170 4.2709 3.8523 2.1491 3.2636 1.0133 3.9594 1.0369 1.0016 1.0077 2.2418 1.0154 1.0036 2.1706 1.0297 4.1853 2.1243 3.8086 1.0040 1.0064 3.9266 1.0056 1.0146 3.8495 1.0093 3.5226 1.0119 1.1217 4.3714 2.2000 2.2632 1.0022 0.9867
dispcorr: -0.077627377 hartree
energy: -1406.337429670462
dipole: 8.53347 -4.65166 3.88180 -1.31259 0.93566 -0.37694 -0.72578 0.41220 -0.31357
magnitude: 3.91265 au
magnitude: 9.94516 debye
zeropoint: 0.30958641 hartree
thermalvibcorrection: 0.01834502 hartree
thermalrotcorrection: 0.00141627 hartree
thermaltrasncorrection: 0.00141627 hartree
thermaltotal: -1406.00666570 hartree
thermalcorr: 0.02117756 hartree
nonthermalcorr: 0.30958641 hartree
totalcorr: 0.33076397 hartree
totalenthalpy: -1406.00572149 hartree
