program: Orca
programVersion: 5.0.2
elementType: N H C H C O C C O N H C H H H O H H S H C O C H H C H H C H N H H C O O H H
charge: 1
multiplicity: 1
keywords: wB97X-D3BJ Opt Freq def2-TZVPP def2/J RIJCOSX VeryTightSCF
keywords: PAL8 defgrid3 TightOpt
frequency: 0.00 0.00 0.00 0.00 0.00 0.00 15.48 25.96 32.58 52.61 62.87 65.18 70.17 78.01 90.10 128.48 137.19 148.48 183.86 197.40 213.42 219.12 236.71 263.48 270.94 290.42 298.63 327.97 333.84 368.32 423.23 439.82 465.97 509.48 522.27 538.93 546.34 554.17 570.02 595.46 631.58 650.89 671.45 692.28 705.96 743.18 770.25 789.22 825.00 847.80 857.92 888.59 894.26 917.38 928.36 1008.56 1023.41 1042.45 1059.22 1082.45 1095.07 1131.39 1140.58 1158.61 1161.20 1191.66 1204.90 1220.10 1236.66 1264.96 1268.73 1304.94 1321.63 1325.88 1335.89 1347.29 1375.28 1378.49 1388.76 1402.83 1433.05 1456.18 1463.54 1473.85 1477.14 1488.61 1495.67 1500.64 1551.29 1567.78 1656.34 1676.62 1776.42 1801.99 1815.82 1902.94 2757.55 3091.08 3095.13 3097.78 3099.28 3113.10 3115.13 3145.76 3148.52 3156.80 3164.46 3170.58 3492.72 3554.49 3621.01 3684.90 3794.81 3812.69
frequency: 15.48 25.96 32.58 52.61 62.87 65.18 70.17 78.01 90.10 128.48 137.19 148.48 183.86 197.40 213.42 219.12 236.71 263.48 270.94 290.42 298.63 327.97 333.84 368.32 423.23 439.82 465.97 509.48 522.27 538.93 546.34 554.17 570.02 595.46 631.58 650.89 671.45 692.28 705.96 743.18 770.25 789.22 825.00 847.80 857.92 888.59 894.26 917.38 928.36 1008.56 1023.41 1042.45 1059.22 1082.45 1095.07 1131.39 1140.58 1158.61 1161.20 1191.66 1204.90 1220.10 1236.66 1264.96 1268.73 1304.94 1321.63 1325.88 1335.89 1347.29 1375.28 1378.49 1388.76 1402.83 1433.05 1456.18 1463.54 1473.85 1477.14 1488.61 1495.67 1500.64 1551.29 1567.78 1656.34 1676.62 1776.42 1801.99 1815.82 1902.94 2757.55 3091.08 3095.13 3097.78 3099.28 3113.10 3115.13 3145.76 3148.52 3156.80 3164.46 3170.58 3492.72 3554.49 3621.01 3684.90 3794.81 3812.69
formula: C10H18N3O6S
InChI: InChI=1S/C10H18N3O6S/c11-5(10(18)19)1-2-7(14)13-6(4-20)9(17)12-3-8(15)16/h5-6,12-13,15,18,20H,1-4H2,11H3
38 atoms
N  -0.884566 -1.773363 1.953731
H  -0.794535 -0.806967 2.214948
C  -1.052531 -2.784786 2.961452
H  -0.985234 -2.329136 3.951111
C  -0.015705 -3.890155 2.908914
O  1.068929 -3.84306 2.362682
C  -1.021906 -2.107383 0.645803
C  -1.070667 -0.937178 -0.34628
O  -1.112006 -3.26908 0.293774
N  -0.004493 0.036434 -0.124684
H  -2.005017 -0.414095 -0.125931
C  -1.154421 -1.444157 -1.787041
H  -0.234258 0.98758 -0.374707
H  -1.058568 -0.598208 -2.464716
H  -0.338004 -2.133994 -1.998832
O  -0.428081 -4.941013 3.601644
H  0.256092 -5.623224 3.595669
H  -2.030853 -3.264163 2.886251
S  -2.715098 -2.304023 -2.122944
H  -3.259641 -1.338587 -2.871343
C  1.350134 -0.19581 -0.225783
O  2.127936 0.698149 -0.469339
C  1.819353 -1.602025 0.108121
H  1.694741 -1.709083 1.187769
H  1.161039 -2.338834 -0.353178
C  3.269376 -1.839331 -0.286712
H  3.861353 -0.955505 -0.050932
H  3.357702 -2.000887 -1.363781
C  3.884576 -3.015352 0.453978
H  4.826408 -3.313797 -0.012194
N  2.987145 -4.232206 0.41705
H  2.143845 -4.084295 1.008479
H  2.695042 -4.440502 -0.53671
C  4.194506 -2.716293 1.923497
O  4.262492 -1.623401 2.391475
O  4.420463 -3.864008 2.592195
H  4.653125 -3.650262 3.506641
H  3.47395 -5.042184 0.800331
totalener: -1406.23047505 hartree
nucrepener: 1895.96199086 hartree
electener: -3302.19246591 hartree
oneelecener: -5675.82611840 hartree
twoeener: 2373.63365248 hartree
kineticenergy: 1401.47777783 hartree
exchangeener: -105.466890733948 hartree
correlationener: -7.062442304619 hartree
xcener: -112.529333038567 hartree
temp: 298.15 k
press: 1.00 atm
thermalcorrenthalpy: 0.00094421 hartree
totalenthalpy: -1405.97869997 hartree
totalentropycorr: -0.07132612 hartree
gibbsenthalpy: -1406.05002609 hartree
gibbsminuselec: 0.26176799 hartree
chargesum: 1.0000000
charge: -0.213895 0.192374 -0.095230 0.143919 0.387793 -0.422966 0.259116 0.043729 -0.364249 -0.251510 0.130278 -0.173692 0.189652 0.123987 0.101938 -0.219994 0.233359 0.152156 -0.127951 0.107535 0.189690 -0.302409 -0.176153 0.128047 0.068490 -0.191084 0.147937 0.121208 0.008121 0.171553 -0.076400 0.251313 0.230797 0.262696 -0.227275 -0.293619 0.254197 0.236543
charge: 0.331359 -0.019552 -0.038792 0.045729 -0.396233 0.103236 -0.390500 -0.157253 0.098985 0.308274 0.041656 -0.241245 -0.012038 0.009536 -0.000419 0.412010 -0.077535 0.047080 0.492890 -0.151558 -0.372755 0.118790 -0.022070 0.029533 0.017705 0.002690 0.052003 0.033439 -0.046002 0.048281 0.612027 -0.010409 0.051517 -0.436857 0.181939 0.357288 -0.070614 0.047864
qa: -0.2139 0.1924 -0.0952 0.1439 0.3878 -0.4230 0.2591 0.0437 -0.3642 -0.2515 0.1303 -0.1737 0.1897 0.1240 0.1019 -0.2200 0.2334 0.1522 -0.1280 0.1075 0.1897 -0.3024 -0.1762 0.1280 0.0685 -0.1911 0.1479 0.1212 0.0081 0.1716 -0.0764 0.2513 0.2308 0.2627 -0.2273 -0.2936 0.2542 0.2365
va: 3.1607 1.0141 3.8719 1.0035 4.1504 2.0414 4.1761 3.7996 2.1631 3.0790 1.0159 4.0483 1.0152 1.0065 1.0048 2.2920 1.0250 1.0104 2.1641 1.0199 4.3645 2.2133 3.6795 1.0375 1.0407 3.8994 1.0347 1.0071 3.7786 0.9979 3.6137 1.0448 0.9734 4.3714 2.2616 2.1900 1.0094 0.9823
dispcorr: -0.081319484 hartree
energy: -1406.311793879253
dipole: 2.94636 -1.10244 1.84392 -1.16449 -1.26147 -2.42596 -3.49198 4.52830 1.03632
magnitude: 3.21859 au
magnitude: 8.18100 debye
zeropoint: 0.31032204 hartree
thermalvibcorrection: 0.01899609 hartree
thermalrotcorrection: 0.00141627 hartree
thermaltrasncorrection: 0.00141627 hartree
thermaltotal: -1405.97964320 hartree
thermalcorr: 0.02182863 hartree
nonthermalcorr: 0.31032204 hartree
totalcorr: 0.33215068 hartree
totalenthalpy: -1405.97869899 hartree
