program: Orca
programVersion: 5.0.2
elementType: N H C H C O C C O N H C H H H O H H S H C O C H H C H H C H N H H C O O H H
charge: 1
multiplicity: 1
keywords: wB97X-D3BJ Opt Freq def2-TZVPP def2/J RIJCOSX VeryTightSCF
keywords: PAL8 defgrid3 TightOpt
frequency: 0.00 0.00 0.00 0.00 0.00 0.00 28.58 37.77 40.15 51.69 55.66 64.28 74.40 90.62 120.10 125.59 146.66 174.67 177.49 209.24 214.74 242.06 257.12 260.59 278.09 311.43 320.76 340.87 381.44 404.68 428.05 477.04 487.16 497.04 505.19 531.85 584.36 587.05 607.43 615.65 635.60 655.88 671.73 700.37 703.85 732.82 744.62 767.10 770.28 831.50 847.37 860.43 899.70 918.23 947.82 1005.59 1017.32 1031.52 1049.30 1072.79 1129.14 1149.56 1169.81 1184.68 1185.17 1203.08 1207.96 1236.06 1254.91 1300.18 1302.52 1311.73 1319.84 1325.98 1344.33 1357.10 1377.81 1383.13 1419.36 1422.70 1437.19 1450.44 1462.91 1465.93 1475.49 1492.49 1492.77 1517.40 1528.91 1576.86 1619.97 1669.51 1736.10 1793.27 1850.13 1866.84 2760.18 3058.83 3084.91 3087.53 3106.32 3119.70 3120.16 3130.86 3131.67 3134.70 3161.76 3178.23 3230.45 3565.73 3604.06 3636.55 3791.26 3835.82
frequency: 28.58 37.77 40.15 51.69 55.66 64.28 74.40 90.62 120.10 125.59 146.66 174.67 177.49 209.24 214.74 242.06 257.12 260.59 278.09 311.43 320.76 340.87 381.44 404.68 428.05 477.04 487.16 497.04 505.19 531.85 584.36 587.05 607.43 615.65 635.60 655.88 671.73 700.37 703.85 732.82 744.62 767.10 770.28 831.50 847.37 860.43 899.70 918.23 947.82 1005.59 1017.32 1031.52 1049.30 1072.79 1129.14 1149.56 1169.81 1184.68 1185.17 1203.08 1207.96 1236.06 1254.91 1300.18 1302.52 1311.73 1319.84 1325.98 1344.33 1357.10 1377.81 1383.13 1419.36 1422.70 1437.19 1450.44 1462.91 1465.93 1475.49 1492.49 1492.77 1517.40 1528.91 1576.86 1619.97 1669.51 1736.10 1793.27 1850.13 1866.84 2760.18 3058.83 3084.91 3087.53 3106.32 3119.70 3120.16 3130.86 3131.67 3134.70 3161.76 3178.23 3230.45 3565.73 3604.06 3636.55 3791.26 3835.82
formula: C10H18N3O6S
InChI: InChI=1S/C10H18N3O6S/c11-5(10(18)19)1-2-7(14)13-6(4-20)9(17)12-3-8(15)16/h5-6,12-13,15,18,20H,1-4H2,11H3
38 atoms
N  -1.041068 -1.173137 -2.635226
H  -1.080274 -1.803969 -3.42142
C  -0.838154 0.216018 -2.929903
H  -1.335334 0.445947 -3.876628
C  0.626166 0.608043 -3.058683
O  1.542001 -0.161394 -2.907287
C  -0.971076 -1.853447 -1.451847
C  -0.85432 -1.142594 -0.08901
O  -1.052565 -3.063715 -1.435609
N  0.01042 0.017315 -0.027113
H  -0.44441 -1.929323 0.543783
C  -2.243214 -0.829683 0.48595
H  -0.427468 0.92789 -0.017243
H  -2.887115 -1.689505 0.30676
H  -2.16819 -0.693068 1.562886
O  0.873456 1.889935 -3.336513
H  0.064642 2.40445 -3.438945
H  -1.31119 0.852285 -2.180105
S  -3.063692 0.629315 -0.217848
H  -2.831584 1.468326 0.797042
C  1.356729 0.021272 -0.007819
O  1.973098 1.090302 0.002022
C  2.067829 -1.320473 -0.003076
H  1.65186 -1.925964 0.804666
H  1.825536 -1.850013 -0.928863
C  3.57685 -1.198001 0.215634
H  3.962226 -2.15388 0.568342
H  3.770746 -0.465298 1.000415
C  4.417558 -0.826233 -1.009357
H  5.447193 -0.677739 -0.677952
N  3.953456 0.44416 -1.647199
H  3.296056 0.228602 -2.419177
H  3.390732 0.982475 -0.949912
C  4.455406 -1.888758 -2.104755
O  4.26818 -1.640591 -3.263137
O  4.748589 -3.089013 -1.607817
H  4.800776 -3.722192 -2.337977
H  4.721462 0.991151 -2.025055
totalener: -1406.23819725 hartree
nucrepener: 1923.00293401 hartree
electener: -3329.24113126 hartree
oneelecener: -5729.63777270 hartree
twoeener: 2400.39664144 hartree
kineticenergy: 1400.65625073 hartree
exchangeener: -105.325649173195 hartree
correlationener: -7.056612317732 hartree
xcener: -112.382261490928 hartree
temp: 298.15 k
press: 1.00 atm
thermalcorrenthalpy: 0.00094421 hartree
totalenthalpy: -1405.99253023 hartree
totalentropycorr: -0.06537282 hartree
gibbsenthalpy: -1406.05790305 hartree
gibbsminuselec: 0.26361412 hartree
chargesum: 1.0000000
charge: -0.165589 0.192200 -0.168308 0.170677 0.387753 -0.369703 0.135764 0.017103 -0.301960 -0.160634 0.131655 -0.154223 0.165779 0.152216 0.139983 -0.221344 0.232066 0.103917 -0.144490 0.120482 0.177564 -0.396285 -0.167829 0.146538 0.142953 -0.198073 0.136072 0.142065 0.011177 0.151114 -0.076152 0.235120 0.227927 0.254811 -0.274284 -0.253961 0.252919 0.224981
charge: 0.330359 -0.003887 -0.078171 0.042921 -0.424448 0.144411 -0.389063 -0.142643 0.109599 0.343480 0.044159 -0.218285 -0.026351 0.025094 0.014672 0.396837 -0.083371 0.005575 0.514583 -0.147819 -0.360284 0.095534 -0.005008 0.041843 0.040293 0.003201 0.042435 0.036813 -0.051606 0.048178 0.608716 0.001425 -0.021826 -0.444082 0.143681 0.391649 -0.067635 0.039023
qa: -0.1656 0.1922 -0.1683 0.1707 0.3878 -0.3697 0.1358 0.0171 -0.3020 -0.1606 0.1317 -0.1542 0.1658 0.1522 0.1400 -0.2213 0.2321 0.1039 -0.1445 0.1205 0.1776 -0.3963 -0.1678 0.1465 0.1430 -0.1981 0.1361 0.1421 0.0112 0.1511 -0.0762 0.2351 0.2279 0.2548 -0.2743 -0.2540 0.2529 0.2250
va: 3.0899 1.0167 3.8543 0.9889 4.1462 2.1330 4.3910 3.7909 2.2275 3.1076 1.0271 3.8929 1.0613 1.0083 0.9983 2.2733 1.0154 1.0695 2.1902 1.0170 4.2183 2.0865 3.7848 0.9973 1.0125 3.8667 1.0170 1.0080 3.8489 0.9979 3.6136 1.0469 1.0588 4.3923 2.2154 2.2424 1.0061 0.9803
dispcorr: -0.084106687 hartree
energy: -1406.326948211898
dipole: 2.95223 -1.30202 1.65022 1.54914 -0.11958 1.42955 6.39263 -6.12162 0.27101
magnitude: 2.20006 au
magnitude: 5.59212 debye
zeropoint: 0.31063563 hartree
thermalvibcorrection: 0.01848432 hartree
thermalrotcorrection: 0.00141627 hartree
thermaltrasncorrection: 0.00141627 hartree
thermaltotal: -1405.99499572 hartree
thermalcorr: 0.02131686 hartree
nonthermalcorr: 0.31063563 hartree
totalcorr: 0.33195249 hartree
totalenthalpy: -1405.99405151 hartree
