program: Orca
programVersion: 5.0.2
elementType: N H C H C O C C O N H C H H H O H H S H C O C H H C H H C H N H H C O O H H
charge: 1
multiplicity: 1
keywords: wB97X-D3BJ Opt Freq def2-TZVPP def2/J RIJCOSX VeryTightSCF
keywords: PAL8 defgrid3 TightOpt
frequency: 0.00 0.00 0.00 0.00 0.00 0.00 24.05 30.27 35.61 47.38 50.38 72.07 90.98 104.90 110.11 127.48 132.30 147.11 175.11 193.72 229.49 237.57 247.79 269.17 272.36 289.08 312.40 359.14 378.37 403.82 418.98 440.69 488.73 508.54 517.84 561.32 566.50 594.53 611.71 631.25 634.86 650.38 690.28 710.87 742.03 748.74 756.17 781.75 822.35 825.64 862.13 896.99 902.66 928.10 949.75 982.00 1008.75 1014.12 1070.44 1075.82 1104.53 1120.10 1138.93 1142.67 1161.35 1197.99 1214.68 1230.62 1246.04 1263.91 1281.63 1291.72 1315.74 1327.93 1332.31 1360.16 1363.41 1375.93 1399.18 1399.58 1415.38 1422.18 1441.92 1480.19 1486.72 1492.64 1504.29 1513.36 1536.75 1568.08 1671.40 1696.83 1811.91 1820.83 1840.32 1901.76 2762.28 3096.78 3097.92 3111.63 3113.60 3120.66 3146.74 3162.78 3173.19 3177.23 3219.09 3230.45 3245.59 3502.93 3612.29 3618.83 3746.78 3787.81
frequency: 24.05 30.27 35.61 47.38 50.38 72.07 90.98 104.90 110.11 127.48 132.30 147.11 175.11 193.72 229.49 237.57 247.79 269.17 272.36 289.08 312.40 359.14 378.37 403.82 418.98 440.69 488.73 508.54 517.84 561.32 566.50 594.53 611.71 631.25 634.86 650.38 690.28 710.87 742.03 748.74 756.17 781.75 822.35 825.64 862.13 896.99 902.66 928.10 949.75 982.00 1008.75 1014.12 1070.44 1075.82 1104.53 1120.10 1138.93 1142.67 1161.35 1197.99 1214.68 1230.62 1246.04 1263.91 1281.63 1291.72 1315.74 1327.93 1332.31 1360.16 1363.41 1375.93 1399.18 1399.58 1415.38 1422.18 1441.92 1480.19 1486.72 1492.64 1504.29 1513.36 1536.75 1568.08 1671.40 1696.83 1811.91 1820.83 1840.32 1901.76 2762.28 3096.78 3097.92 3111.63 3113.60 3120.66 3146.74 3162.78 3173.19 3177.23 3219.09 3230.45 3245.59 3502.93 3612.29 3618.83 3746.78 3787.81
formula: C10H18N3O6S
InChI: InChI=1S/C10H18N3O6S/c11-5(10(18)19)1-2-7(14)13-6(4-20)9(17)12-3-8(15)16/h5-6,12-13,15,18,20H,1-4H2,11H3
38 atoms
N  -1.798912 -2.061297 -2.141312
H  -2.324156 -1.870237 -2.982982
C  -0.691241 -2.992894 -2.249407
H  -0.815355 -3.576105 -3.164433
C  -0.655784 -3.974859 -1.084905
O  0.38191 -4.379555 -0.60762
C  -1.820793 -1.000719 -1.250381
C  -0.921871 -1.09328 -0.006022
O  -2.552603 -0.055694 -1.40278
N  0.015319 0.00461 -0.001631
H  -0.348719 -2.010583 -0.000566
C  -1.829993 -1.104977 1.226113
H  -0.373976 0.936081 -0.058143
H  -2.374252 -0.164666 1.295529
H  -2.54666 -1.922295 1.149847
O  -1.825052 -4.340108 -0.581496
H  -2.537987 -3.880019 -1.050404
H  0.284397 -2.507713 -2.306917
S  -0.810959 -1.344248 2.712628
H  -1.768591 -1.848658 3.498116
C  1.390401 -0.024745 0.026979
O  2.0300 1.001105 0.042014
C  2.102997 -1.369052 0.090934
H  1.482794 -2.197618 -0.244104
H  2.939341 -1.302718 -0.60506
C  2.637837 -1.606696 1.513974
H  1.984896 -1.147438 2.259878
H  3.610291 -1.132759 1.631589
C  2.797892 -3.085122 1.853903
H  3.376652 -3.601324 1.083992
N  1.457348 -3.770937 1.921194
H  0.73473 -3.126801 2.288979
H  1.131564 -4.092653 0.993876
C  3.561491 -3.265654 3.16562
O  4.562904 -2.672211 3.416627
O  2.985893 -4.184317 3.968101
H  3.528646 -4.283849 4.763422
H  1.507683 -4.577014 2.545092
totalener: -1406.21296180 hartree
nucrepener: 1903.91488538 hartree
electener: -3310.12784718 hartree
oneelecener: -5689.45452845 hartree
twoeener: 2379.32668127 hartree
kineticenergy: 1400.63347537 hartree
exchangeener: -105.311289507152 hartree
correlationener: -7.054448788817 hartree
xcener: -112.365738295969 hartree
temp: 298.15 k
press: 1.00 atm
thermalcorrenthalpy: 0.00094421 hartree
totalenthalpy: -1405.96700018 hartree
totalentropycorr: -0.06572876 hartree
gibbsenthalpy: -1406.03272894 hartree
gibbsminuselec: 0.26380865 hartree
chargesum: 1.0000000
charge: -0.258333 0.209737 -0.125236 0.163884 0.383443 -0.366060 0.201685 0.078140 -0.275386 -0.193835 -0.078395 -0.125800 0.204548 0.156554 0.120579 -0.204488 0.240553 0.145472 -0.143534 0.139466 0.192803 -0.298362 -0.101396 0.010077 0.156418 -0.303579 0.134466 0.162947 0.050111 0.152946 -0.062842 0.170484 0.231462 0.279276 -0.233942 -0.294146 0.254657 0.225626
charge: 0.300028 -0.009240 -0.049843 0.049423 -0.437432 0.123969 -0.368138 -0.166149 0.144572 0.334303 0.006059 -0.210246 0.001376 0.019251 0.009667 0.410788 -0.088457 0.035094 0.537102 -0.136169 -0.388310 0.120318 -0.008316 -0.001353 0.044520 0.000047 0.025884 0.050959 -0.043392 0.051615 0.600247 -0.017858 -0.014099 -0.427825 0.180030 0.355255 -0.066442 0.032762
qa: -0.2583 0.2097 -0.1252 0.1639 0.3834 -0.3661 0.2017 0.0781 -0.2754 -0.1938 -0.0784 -0.1258 0.2045 0.1566 0.1206 -0.2045 0.2406 0.1455 -0.1435 0.1395 0.1928 -0.2984 -0.1014 0.0101 0.1564 -0.3036 0.1345 0.1629 0.0501 0.1529 -0.0628 0.1705 0.2315 0.2793 -0.2339 -0.2941 0.2547 0.2256
va: 3.0416 1.0006 3.8732 0.9892 4.1451 2.1368 4.3271 3.9160 2.2522 3.1029 1.1302 3.9194 1.0168 1.0127 1.0143 2.2845 1.0206 1.0000 2.2784 1.0156 4.3395 2.2326 3.7136 1.0657 1.0225 3.9770 1.0018 1.0288 3.7213 1.0029 3.5152 1.1388 1.0606 4.3560 2.2680 2.1817 1.0074 0.9977
dispcorr: -0.083555324 hartree
energy: -1406.302537685974
dipole: -0.85772 -0.05444 -0.91216 -4.91602 1.40657 -3.50945 -1.25362 1.53090 0.27728
magnitude: 3.63664 au
magnitude: 9.24361 debye
zeropoint: 0.31104763 hartree
thermalvibcorrection: 0.01854895 hartree
thermalrotcorrection: 0.00141627 hartree
thermaltrasncorrection: 0.00141627 hartree
thermaltotal: -1405.97010856 hartree
thermalcorr: 0.02138149 hartree
nonthermalcorr: 0.31104763 hartree
totalcorr: 0.33242913 hartree
totalenthalpy: -1405.96916435 hartree
