program: Orca
programVersion: 5.0.2
elementType: N H C H C O C C O N H C H H H O H H S H C O C H H C H H C H N H H C O O H H
charge: 1
multiplicity: 1
keywords: wB97X-D3BJ Opt Freq def2-TZVPP def2/J RIJCOSX VeryTightSCF
keywords: PAL8 defgrid3 TightOpt
frequency: 0.00 0.00 0.00 0.00 0.00 0.00 7.64 43.35 55.40 60.90 62.56 78.95 87.60 90.11 99.51 104.95 123.07 144.18 174.91 215.83 226.76 236.21 256.71 274.04 298.46 303.58 317.22 338.94 401.70 450.87 458.27 468.87 511.66 529.11 548.71 553.33 559.61 595.04 612.43 623.75 634.87 672.71 692.66 739.63 745.01 753.03 759.06 781.07 812.48 828.77 862.96 888.24 892.75 935.81 954.86 970.18 995.03 1002.27 1053.48 1095.14 1097.99 1140.89 1148.51 1161.66 1172.28 1195.61 1217.24 1223.25 1243.06 1265.02 1272.16 1303.88 1324.86 1335.28 1349.12 1359.35 1370.37 1379.58 1395.18 1408.91 1428.67 1434.20 1460.92 1474.84 1482.98 1485.56 1499.21 1500.70 1508.94 1552.81 1619.47 1702.21 1717.56 1818.74 1867.81 1879.76 2451.74 2758.61 3095.91 3102.97 3107.44 3111.18 3114.72 3161.28 3164.03 3175.43 3197.29 3217.09 3503.57 3573.96 3595.02 3620.29 3790.62 3794.30
frequency: 7.64 43.35 55.40 60.90 62.56 78.95 87.60 90.11 99.51 104.95 123.07 144.18 174.91 215.83 226.76 236.21 256.71 274.04 298.46 303.58 317.22 338.94 401.70 450.87 458.27 468.87 511.66 529.11 548.71 553.33 559.61 595.04 612.43 623.75 634.87 672.71 692.66 739.63 745.01 753.03 759.06 781.07 812.48 828.77 862.96 888.24 892.75 935.81 954.86 970.18 995.03 1002.27 1053.48 1095.14 1097.99 1140.89 1148.51 1161.66 1172.28 1195.61 1217.24 1223.25 1243.06 1265.02 1272.16 1303.88 1324.86 1335.28 1349.12 1359.35 1370.37 1379.58 1395.18 1408.91 1428.67 1434.20 1460.92 1474.84 1482.98 1485.56 1499.21 1500.70 1508.94 1552.81 1619.47 1702.21 1717.56 1818.74 1867.81 1879.76 2451.74 2758.61 3095.91 3102.97 3107.44 3111.18 3114.72 3161.28 3164.03 3175.43 3197.29 3217.09 3503.57 3573.96 3595.02 3620.29 3790.62 3794.30
formula: C10H18N3O6S
InChI: InChI=1S/C10H18N3O6S/c11-5(10(18)19)1-2-7(14)13-6(4-20)9(17)12-3-8(15)16/h5-6,12-13,15,18,20H,1-4H2,11H3
38 atoms
N  -2.144218 -1.435709 -1.901903
H  -2.910145 -1.096842 -2.466556
C  -1.006503 -2.00278 -2.613169
H  -1.326513 -2.229689 -3.631895
C  -0.491632 -3.303752 -2.006794
O  0.671212 -3.602479 -2.034032
C  -2.022675 -0.736753 -0.725328
C  -0.823195 -1.055887 0.184613
O  -2.831052 0.092771 -0.37758
N  0.077385 0.083833 0.102019
H  -0.286047 -1.93541 -0.148987
C  -1.328496 -1.29504 1.611641
H  -0.34956 0.999174 0.172978
H  -1.946204 -0.460394 1.935943
H  -1.957462 -2.186508 1.617978
O  -1.405891 -4.088401 -1.427978
H  -2.273691 -3.665092 -1.471265
H  -0.166715 -1.31189 -2.685588
S  0.00348 -1.597874 2.793371
H  0.250445 -0.319285 3.097912
C  1.40886 0.086142 0.062343
O  2.018298 1.176815 0.064189
C  2.218191 -1.192462 0.006528
H  2.905711 -1.120645 0.853008
H  1.625787 -2.082629 0.1888
C  2.996907 -1.400971 -1.309172
H  2.338005 -1.838304 -2.058026
H  3.772316 -2.145325 -1.118394
C  3.638378 -0.170117 -1.93985
H  4.384428 -0.480472 -2.675314
N  4.320298 0.686183 -0.914862
H  3.499546 1.018638 -0.285174
H  5.011464 0.159929 -0.385882
C  2.631533 0.705962 -2.689956
O  1.557171 0.330997 -3.058795
O  3.142255 1.922068 -2.921211
H  2.496359 2.452314 -3.408942
H  4.767958 1.493618 -1.344944
totalener: -1406.22459716 hartree
nucrepener: 1923.41392078 hartree
electener: -3329.63851794 hartree
oneelecener: -5730.13800347 hartree
twoeener: 2400.49948554 hartree
kineticenergy: 1400.63576501 hartree
exchangeener: -105.316369018960 hartree
correlationener: -7.056431216473 hartree
xcener: -112.372800235433 hartree
temp: 298.15 k
press: 1.00 atm
thermalcorrenthalpy: 0.00094421 hartree
totalenthalpy: -1405.98001858 hartree
totalentropycorr: -0.06551875 hartree
gibbsenthalpy: -1406.04553733 hartree
gibbsminuselec: 0.26288888 hartree
chargesum: 1.0000000
charge: -0.252927 0.202490 -0.061847 0.146495 0.270766 -0.302198 0.208563 -0.026490 -0.294426 -0.105107 0.081418 -0.130327 0.204032 0.146479 0.126926 -0.216404 0.225233 0.102393 -0.132618 0.108580 0.218274 -0.406962 -0.193487 0.140106 0.128962 -0.195218 0.126770 0.137045 -0.022765 0.162320 -0.076755 0.228913 0.218069 0.305932 -0.278677 -0.278993 0.255548 0.229886
charge: 0.304017 -0.010948 -0.052781 0.042981 -0.464578 0.128734 -0.374603 -0.136262 0.127589 0.371988 0.023938 -0.234049 0.011877 0.016006 0.019358 0.392243 -0.102850 0.025808 0.510060 -0.149511 -0.340347 0.132072 -0.008842 0.037845 0.029075 0.007154 0.037584 0.037652 -0.055788 0.048259 0.592239 -0.063654 0.036628 -0.434082 0.151292 0.375318 -0.066801 0.035379
qa: -0.2529 0.2025 -0.0618 0.1465 0.2708 -0.3022 0.2086 -0.0265 -0.2944 -0.1051 0.0814 -0.1303 0.2040 0.1465 0.1269 -0.2164 0.2252 0.1024 -0.1326 0.1086 0.2183 -0.4070 -0.1935 0.1401 0.1290 -0.1952 0.1268 0.1370 -0.0228 0.1623 -0.0768 0.2289 0.2181 0.3059 -0.2787 -0.2790 0.2555 0.2299
va: 3.0748 1.0042 3.8762 0.9899 4.2773 2.1856 4.2998 3.9669 2.2273 3.1771 1.0479 3.9301 1.0143 1.0211 1.0124 2.2460 1.0286 1.0444 2.1914 1.0231 4.2188 2.1067 3.8373 1.0148 1.0340 3.8132 1.0594 1.0047 3.8541 0.9997 3.5365 1.0962 0.9820 4.3300 2.1786 2.2237 1.0083 0.9883
dispcorr: -0.083928814 hartree
energy: -1406.314304397921
dipole: 8.27908 -5.01374 3.26534 0.81208 0.90149 1.71356 -0.45807 -0.78927 -1.24734
magnitude: 3.89289 au
magnitude: 9.89495 debye
zeropoint: 0.31055590 hartree
thermalvibcorrection: 0.01830045 hartree
thermalrotcorrection: 0.00141627 hartree
thermaltrasncorrection: 0.00141627 hartree
thermaltotal: -1405.98261550 hartree
thermalcorr: 0.02113300 hartree
nonthermalcorr: 0.31055590 hartree
totalcorr: 0.33168890 hartree
totalenthalpy: -1405.98167129 hartree
