program: Orca
programVersion: 5.0.2
elementType: N H C H C O C C O N H C H H H O H H S H C O C H H C H H C H N H H C O O H H
charge: 1
multiplicity: 1
keywords: wB97X-D3BJ Opt Freq def2-TZVPP def2/J RIJCOSX VeryTightSCF
keywords: PAL8 defgrid3 TightOpt
frequency: 0.00 0.00 0.00 0.00 0.00 0.00 24.99 30.69 47.37 68.45 73.27 78.34 86.06 93.10 104.36 123.81 132.53 140.07 177.18 192.29 202.08 217.55 250.29 268.70 272.73 281.39 290.01 307.73 374.14 397.59 408.83 444.40 472.18 501.21 510.34 525.52 561.37 576.03 598.63 616.82 632.53 649.47 658.28 682.47 688.92 728.90 761.17 771.52 787.29 826.14 862.93 874.03 881.94 904.05 939.16 987.65 997.68 1032.21 1042.28 1056.89 1067.95 1096.00 1153.77 1169.24 1181.40 1198.08 1210.45 1247.89 1256.95 1262.50 1288.98 1312.49 1323.79 1335.36 1346.30 1349.62 1366.16 1375.67 1405.00 1450.32 1454.40 1465.59 1469.93 1484.14 1484.47 1494.97 1499.23 1511.80 1512.97 1538.94 1648.97 1671.11 1778.26 1807.45 1814.68 1842.26 2747.13 3076.45 3081.75 3097.82 3101.39 3107.22 3145.71 3145.97 3148.29 3150.10 3156.09 3289.86 3497.41 3556.19 3612.73 3650.86 3790.22 3810.87
frequency: 24.99 30.69 47.37 68.45 73.27 78.34 86.06 93.10 104.36 123.81 132.53 140.07 177.18 192.29 202.08 217.55 250.29 268.70 272.73 281.39 290.01 307.73 374.14 397.59 408.83 444.40 472.18 501.21 510.34 525.52 561.37 576.03 598.63 616.82 632.53 649.47 658.28 682.47 688.92 728.90 761.17 771.52 787.29 826.14 862.93 874.03 881.94 904.05 939.16 987.65 997.68 1032.21 1042.28 1056.89 1067.95 1096.00 1153.77 1169.24 1181.40 1198.08 1210.45 1247.89 1256.95 1262.50 1288.98 1312.49 1323.79 1335.36 1346.30 1349.62 1366.16 1375.67 1405.00 1450.32 1454.40 1465.59 1469.93 1484.14 1484.47 1494.97 1499.23 1511.80 1512.97 1538.94 1648.97 1671.11 1778.26 1807.45 1814.68 1842.26 2747.13 3076.45 3081.75 3097.82 3101.39 3107.22 3145.71 3145.97 3148.29 3150.10 3156.09 3289.86 3497.41 3556.19 3612.73 3650.86 3790.22 3810.87
formula: C10H18N3O6S
InChI: InChI=1S/C10H18N3O6S/c11-5(10(18)19)1-2-7(14)13-6(4-20)9(17)12-3-8(15)16/h5-6,12-13,15,18,20H,1-4H2,11H3
38 atoms
N  -0.958655 -3.510227 -0.437057
H  -0.828441 -4.200953 -1.159088
C  -1.5498 -3.939563 0.799157
H  -2.346561 -3.273133 1.138076
C  -0.59142 -4.090211 1.970046
O  0.56778 -3.735539 1.998771
C  -0.659029 -2.235667 -0.841174
C  -0.883461 -1.117565 0.182895
O  -0.240509 -2.016219 -1.956102
N  0.009736 -0.00372 -0.006683
H  -0.74192 -1.521494 1.189773
C  -2.342063 -0.631641 0.084849
H  -0.41289 0.888142 -0.220758
H  -3.017823 -1.486265 0.107831
H  -2.568673 -0.010789 0.952836
O  -1.209649 -4.655042 2.999156
H  -0.604771 -4.723783 3.749598
H  -2.029974 -4.907717 0.650445
S  -2.706387 0.405258 -1.349928
H  -2.177814 -0.405376 -2.275995
C  1.364276 -0.000928 0.009658
O  1.999817 1.038917 0.011773
C  2.091038 -1.341739 -0.031941
H  1.511358 -2.135756 0.439226
H  2.149208 -1.608928 -1.089104
C  3.504522 -1.23479 0.534784
H  3.94685 -0.295058 0.202991
H  4.133118 -2.045335 0.15562
C  3.57153 -1.254186 2.063193
H  4.598359 -1.129152 2.405797
N  3.078758 -2.579892 2.579677
H  2.075212 -2.722939 2.377056
H  3.593218 -3.346306 2.147341
C  2.671239 -0.198856 2.690032
O  1.551954 -0.460884 3.05344
O  3.274395 0.97092 2.756812
H  2.636505 1.656846 3.001865
H  3.18643 -2.64664 3.591067
totalener: -1406.22373717 hartree
nucrepener: 1919.26209048 hartree
electener: -3325.48582765 hartree
oneelecener: -5722.75988376 hartree
twoeener: 2397.27405611 hartree
kineticenergy: 1400.64340672 hartree
exchangeener: -105.323423754509 hartree
correlationener: -7.054458348579 hartree
xcener: -112.377882103087 hartree
temp: 298.15 k
press: 1.00 atm
thermalcorrenthalpy: 0.00094421 hartree
totalenthalpy: -1405.97712640 hartree
totalentropycorr: -0.06605073 hartree
gibbsenthalpy: -1406.04317713 hartree
gibbsminuselec: 0.26341203 hartree
chargesum: 1.0000000
charge: -0.187004 0.195195 -0.116478 0.131725 0.357005 -0.406271 0.136600 0.045564 -0.302559 -0.132901 0.104320 -0.186317 0.177749 0.108286 0.150250 -0.221560 0.236829 0.163555 -0.135429 0.128282 0.144502 -0.346599 -0.109537 0.032587 0.153817 -0.221825 0.153635 0.117363 0.025458 0.185428 -0.079919 0.248557 0.229266 0.244733 -0.302477 -0.213831 0.259465 0.232536
charge: 0.326007 -0.009569 -0.055484 0.038346 -0.410715 0.090548 -0.399363 -0.155161 0.111695 0.340808 0.026737 -0.240394 -0.022406 0.003166 0.016076 0.406596 -0.076943 0.049223 0.507035 -0.138796 -0.386437 0.084281 -0.008897 0.011980 0.049070 0.002771 0.050199 0.029246 -0.046263 0.045183 0.615518 0.004899 0.054245 -0.455091 0.123242 0.423597 -0.059469 0.054521
qa: -0.1870 0.1952 -0.1165 0.1317 0.3570 -0.4063 0.1366 0.0456 -0.3026 -0.1329 0.1043 -0.1863 0.1777 0.1083 0.1503 -0.2216 0.2368 0.1636 -0.1354 0.1283 0.1445 -0.3466 -0.1095 0.0326 0.1538 -0.2218 0.1536 0.1174 0.0255 0.1854 -0.0799 0.2486 0.2293 0.2447 -0.3025 -0.2138 0.2595 0.2325
va: 3.0730 1.0128 3.8499 1.0100 4.2066 2.0743 4.3531 3.7742 2.2156 3.1045 1.0136 3.9786 1.0490 1.0097 0.9888 2.2858 1.0214 1.0035 2.1718 1.0279 4.3721 2.1722 3.7256 1.0558 1.0116 3.9149 1.0285 1.0052 3.7853 0.9910 3.6776 1.0398 0.9764 4.4805 2.1878 2.3317 1.0031 0.9756
dispcorr: -0.083252396 hartree
energy: -1406.311771551520
dipole: 4.90077 -2.72383 2.17693 -7.73234 4.29710 -3.43524 3.51219 0.02017 3.53237
magnitude: 5.38679 au
magnitude: 13.69213 debye
zeropoint: 0.31042023 hartree
thermalvibcorrection: 0.01881590 hartree
thermalrotcorrection: 0.00141627 hartree
thermaltrasncorrection: 0.00141627 hartree
thermaltotal: -1405.97970288 hartree
thermalcorr: 0.02164844 hartree
nonthermalcorr: 0.31042023 hartree
totalcorr: 0.33206868 hartree
totalenthalpy: -1405.97875867 hartree
