program: Gaussian 09
title: 000047339
version: EM64L-G09RevD.01
frameworkgroup: C1[X(C18H28N2)]
method: RPBEPBE
basis: SDD
operation: Freq
keyword: #pfreq=noraman
keyword: PBEPBE/SDD
title: #p freq=noraman PBEPBE/SDD
converged: NO YES NO NO
title: Mulliken charges:
elementType: N N C C C C C C C C C C C C C C C C C C H H H H H H H H H H H H H H H H H H H H H H H H H H H H
charge: -0.054603 -0.073192 -0.119930 -0.122547 -0.478262 -0.393536 -0.389251 -0.388443 -0.399007 -0.336818 -0.482320 -0.412645 0.443819 -0.327910 -0.370262 -0.455165 -0.692698 -0.223924 -0.223594 -0.255636 0.196371 0.195329 0.210076 0.211102 0.171870 0.212403 0.210358 0.168177 0.226995 0.175124 0.170975 0.210857 0.174782 0.200273 0.218308 0.186568 0.205380 0.192972 0.186204 0.229522 0.282544 0.231302 0.209294 0.205022 0.208242 0.219999 0.221650 0.224226
chargesum: 0.00000
title: Mulliken charges with hydrogens summed into heavy atoms:
elementType: N N C C C C C C C C C C C C C C C C C C
charge: -0.054603 -0.073192 0.076442 0.072782 -0.057083 -0.009264 -0.010717 0.013676 -0.017175 0.038237 -0.077444 -0.014294 0.443819 0.087816 -0.087718 -0.223862 -0.070140 -0.003925 -0.001944 -0.031410
polarizability: 2.28596623e+02 7.12141772e+00 2.17852768e+02 1.34628494e+01 8.44407100e-01 1.49893720e+02
1716.lowfreq: -11.2500 -0.0006 -0.0006 -0.0006 4.5930 5.9895 21.2982 32.5206 39.0869
frequency: 20.9708 32.3795 38.9589 57.0634 60.4915 70.6874 122.1729 139.8346 155.4904 201.8562 207.4469 236.5238 253.6845 267.0143 284.7315 297.4207 306.1538 320.0445 357.3009 375.3567 402.8715 404.6353 408.2271 460.3142 485.1359 535.5254 560.9533 598.7200 616.8942 659.1586 698.8122 708.6121 741.1787 748.8312 782.5567 793.2446 818.0210 823.3226 830.5961 861.9928 866.2299 904.0195 915.6538 923.9701 928.6089 948.1114 970.6624 973.0935 975.2418 983.4891 989.6502 993.3737 1001.5599 1009.9975 1021.2544 1029.1319 1050.3970 1073.1372 1080.0300 1088.7899 1098.2276 1117.1056 1125.8632 1131.3966 1137.7863 1151.4974 1153.8210 1169.1796 1181.6101 1192.7597 1204.0561 1210.1700 1218.3618 1245.3699 1256.4924 1260.8921 1265.9881 1280.6891 1290.1683 1300.9717 1306.5220 1312.4978 1329.5024 1330.3438 1335.6318 1343.1358 1349.1063 1359.1356 1360.5498 1367.7094 1379.7316 1381.8934 1387.9752 1394.2590 1402.0916 1440.3132 1456.4597 1457.2498 1466.6749 1467.8911 1469.1006 1473.4601 1475.7583 1476.6493 1478.4280 1482.6170 1486.3075 1490.3070 1594.3465 1614.6335 2776.6515 2783.8575 2785.5707 2794.8391 2803.6718 2820.5831 2966.1429 2970.1865 2970.6445 2979.0377 2979.8093 2988.5695 2990.0372 2991.4346 2996.0206 3002.2986 3008.5538 3018.5913 3020.8770 3034.4723 3045.2488 3063.7082 3073.3996 3108.8046 3118.8830 3133.0692 3145.6218 3157.8706
redmass: 3.7653 3.7176 3.8313 3.7275 3.5424 1.7097 3.4000 2.7517 2.4610 1.8952 3.5902 1.4283 3.1789 3.1342 2.5559 2.9079 2.4455 2.4841 1.9457 2.0210 2.3447 2.8870 2.8389 3.0653 3.0127 2.8820 2.8669 4.3883 6.3555 4.7218 3.5885 2.1353 1.3361 1.4605 3.0509 3.4054 2.7672 1.9508 2.7236 1.2504 1.5963 1.4607 1.5217 2.0006 1.5111 1.4011 1.9779 1.9203 1.9607 1.3809 5.3868 3.3000 1.4280 2.1922 1.9669 1.9779 2.6475 1.7021 1.4395 1.7835 1.4792 2.1777 1.8932 2.2292 1.6788 1.9809 2.2036 1.0569 1.1173 1.1907 1.4215 2.3184 1.1811 1.2656 1.2658 1.3572 1.5649 1.6353 1.2032 1.6488 1.3655 1.5179 1.5837 1.3418 1.6627 1.4913 1.5947 1.3362 1.4987 1.5404 1.4513 2.8315 1.2192 1.7343 1.4556 2.0636 1.1154 1.0853 1.0806 1.0799 1.1001 1.0839 1.0436 1.0759 1.1501 1.9489 1.0896 1.1014 6.2015 6.0412 1.0717 1.0717 1.0723 1.0715 1.0703 1.0704 1.0393 1.0619 1.0571 1.0674 1.0849 1.0872 1.0847 1.0856 1.0843 1.0844 1.0867 1.0893 1.0904 1.1032 1.0974 1.0989 1.0996 1.0867 1.0864 1.0920 1.0946 1.1012
irintensity: 0.1832 0.1314 0.0124 0.5364 0.0174 0.0949 0.9832 1.2922 0.4818 0.1742 0.9393 0.1940 1.8030 1.5765 1.1353 3.4285 4.5689 2.6009 0.8739 0.4021 0.5147 0.2437 0.2515 8.4977 1.1726 0.9829 2.4192 3.0912 0.2473 1.0333 18.6125 24.3210 32.2273 36.0762 8.1614 7.9366 4.4095 1.2651 0.7556 0.3291 2.7124 6.0778 0.2088 10.0930 1.1377 0.8567 1.8037 7.2658 0.3266 0.4903 0.4850 27.7251 1.3081 3.4293 5.0358 13.1250 2.6011 18.9007 13.9481 5.0339 1.8813 5.4164 7.9150 52.5984 1.7297 26.1729 17.6621 0.3912 0.9435 1.7771 2.9323 8.2745 3.6217 5.1184 16.4341 7.4317 25.6224 11.4439 3.2207 12.2751 2.8738 11.1784 3.5105 2.5001 3.7736 16.9561 4.7593 0.9077 2.2283 4.6274 1.7138 3.2720 13.3903 0.3066 2.2402 17.6078 6.8914 17.5974 1.5811 5.1582 2.8139 9.0000 15.3919 3.0456 15.3215 18.2524 6.8650 8.7720 0.5959 6.5429 43.4171 100.5733 12.6830 117.3759 352.5049 189.7781 31.1506 26.8076 35.1230 36.7664 21.7888 11.4418 30.2486 0.4579 143.3393 112.4007 2.7144 14.5982 72.4708 47.9457 0.7468 57.7901 106.3567 9.5915 2.1308 31.0455 19.4875 31.3186
temp: 298.150 k
press: 1.00000 atm
elementType: 7 7 6 6 6 6 6 6 6 6 6 6 6 6 6 6 6 6 6 6 1 1 1 1 1 1 1 1 1 1 1 1 1 1 1 1 1 1 1 1 1 1 1 1 1 1 1 1
symmnumber: 1
zpe: 1116491.1 jmol-1
zpe.correction: 0.425249 hartree
zpe.thermalcorrener: 0.444476 hartree
zpe.thermalcorrenthalpy: 0.445420 hartree
zpe.thermalcorrgfe: 0.376351 hartree
zpe.sumelectzpe: -810.636335 hartree
zpe.sumelectthermal: -810.617108 hartree
zpe.sumelectthermalent: -810.616163 hartree
zpe.sumelectthermalfe: -810.685233 hartree
dipole: -1.3827 -1.0033 0.3658
dipole: 1.7471
quadrupole: -118.9499 -116.6454 -123.0062
quadrupole: 0.1638 2.4724 0.0922
quadrupole: 0.5839 2.8884 -3.4723 0.1638 2.4724 0.0922
hfenergy: -811.0615837 hartree
pointgroup: C01 [X(C18H28N2)]
dipole: -0.6084684 -0.2896862 0.1352627 debye
polarizability: 230.5448336|4.5766862|215.6721498|14.1925662|-0.928197|150.1261276 unknown
InChI: InChI=1S/C18H28N2/c1-2-3-9-19-12-17-10-18(13-19)15-20(14-17)11-16-7-5-4-6-8-16/h4-8,17-18H,2-3,9-15H2,1H3
charge 0 multiplicity 1
48 atoms
N  -2.11674 0.835639 -0.224278
N  -0.277377 -1.63442 -0.32603
C  -1.875503 -0.984799 1.53156
C  -2.772338 -1.59072 -0.690959
C  -2.984921 -1.795916 0.82601
C  -2.079612 0.519842 1.223361
C  -2.955499 -0.091241 -1.0264
C  -0.493833 -1.563138 1.135402
C  -1.407478 -2.199164 -1.091004
C  -2.524398 2.237103 -0.495683
C  1.015841 -2.247531 -0.684266
C  -1.618552 3.31939 0.12944
C  2.217626 -1.37897 -0.318934
C  -0.143524 3.245707 -0.319667
C  2.145854 0.027634 -0.476185
C  3.428212 -1.95863 0.1319
C  0.715062 4.386007 0.268027
C  3.265315 0.839458 -0.191813
C  4.553745 -1.148629 0.412431
C  4.475929 0.253944 0.250887
H  -1.963043 -1.097336 2.63091
H  -3.547288 -2.141476 -1.261202
H  -2.915979 -2.869701 1.089094
H  -3.987096 -1.438312 1.133513
H  -3.035277 0.83571 1.728955
H  -1.263698 1.104327 1.688859
H  -2.728583 0.087015 -2.096347
H  -4.048612 0.140064 -0.884198
H  0.315822 -0.949511 1.573376
H  -0.413627 -2.58431 1.602337
H  -1.489116 -3.313235 -0.951804
H  -1.215117 -2.023565 -2.16825
H  -3.580809 2.413892 -0.148284
H  -2.52628 2.369404 -1.596754
H  1.009937 -2.401183 -1.783171
H  1.145562 -3.264662 -0.226019
H  -1.670642 3.273074 1.235891
H  -2.039149 4.306804 -0.152898
H  -0.101382 3.276553 -1.427744
H  0.271253 2.265488 -0.023121
H  1.193023 0.456901 -0.806402
H  3.491063 -3.046233 0.267092
H  1.766144 4.316895 -0.069811
H  0.327874 5.377035 -0.03751
H  0.71554 4.353868 1.37437
H  3.194947 1.92723 -0.31323
H  5.485197 -1.609412 0.761603
H  5.345831 0.883211 0.471845
