program: Orca
programVersion: 5.0.2
elementType: N H C H C O C C O N H C H H H O H H S H C O C H H C H H C H N H H C O O H H
charge: 1
multiplicity: 1
keywords: wB97X-D3BJ Opt Freq def2-TZVPP def2/J RIJCOSX VeryTightSCF
keywords: PAL8 defgrid3 TightOpt
frequency: 0.00 0.00 0.00 0.00 0.00 0.00 32.63 42.39 50.00 51.43 58.62 73.49 83.48 97.92 103.59 110.14 121.83 157.18 196.69 213.73 218.24 226.93 246.31 288.17 304.70 312.31 326.88 346.97 377.56 405.48 439.81 463.34 481.42 513.41 524.87 542.30 589.41 597.80 616.31 623.38 657.03 660.63 688.38 697.76 732.41 734.79 746.02 764.34 779.51 809.36 852.35 880.21 902.49 937.00 969.32 981.89 1001.57 1018.13 1065.37 1069.54 1106.13 1143.25 1166.10 1176.46 1189.82 1204.14 1213.29 1245.17 1256.76 1268.70 1275.05 1297.84 1317.72 1321.49 1338.87 1345.03 1362.46 1383.60 1416.97 1434.56 1452.72 1457.98 1465.67 1468.65 1484.34 1489.56 1494.73 1507.71 1516.45 1535.00 1657.47 1686.98 1753.33 1801.22 1817.90 1839.94 2758.73 3081.18 3091.96 3097.01 3118.61 3121.56 3128.00 3158.51 3163.53 3174.11 3176.77 3177.34 3380.74 3465.06 3593.43 3618.17 3787.54 3791.83
frequency: 32.63 42.39 50.00 51.43 58.62 73.49 83.48 97.92 103.59 110.14 121.83 157.18 196.69 213.73 218.24 226.93 246.31 288.17 304.70 312.31 326.88 346.97 377.56 405.48 439.81 463.34 481.42 513.41 524.87 542.30 589.41 597.80 616.31 623.38 657.03 660.63 688.38 697.76 732.41 734.79 746.02 764.34 779.51 809.36 852.35 880.21 902.49 937.00 969.32 981.89 1001.57 1018.13 1065.37 1069.54 1106.13 1143.25 1166.10 1176.46 1189.82 1204.14 1213.29 1245.17 1256.76 1268.70 1275.05 1297.84 1317.72 1321.49 1338.87 1345.03 1362.46 1383.60 1416.97 1434.56 1452.72 1457.98 1465.67 1468.65 1484.34 1489.56 1494.73 1507.71 1516.45 1535.00 1657.47 1686.98 1753.33 1801.22 1817.90 1839.94 2758.73 3081.18 3091.96 3097.01 3118.61 3121.56 3128.00 3158.51 3163.53 3174.11 3176.77 3177.34 3380.74 3465.06 3593.43 3618.17 3787.54 3791.83
formula: C10H18N3O6S
InChI: InChI=1S/C10H18N3O6S/c11-5(10(18)19)1-2-7(14)13-6(4-20)9(17)12-3-8(15)16/h5-6,12-13,15,18,20H,1-4H2,11H3
38 atoms
N  -1.143975 -2.447242 -2.569424
H  -0.972324 -2.487905 -3.563967
C  -1.338414 -3.721038 -1.921672
H  -1.829725 -3.619498 -0.953722
C  -0.01599 -4.45084 -1.71329
O  1.071134 -3.965645 -1.933662
C  -0.556409 -1.368449 -1.986255
C  -0.786314 -1.133555 -0.482428
O  0.108243 -0.583491 -2.65022
N  0.016559 -0.034176 -0.011079
H  -0.512386 -2.040031 0.063082
C  -2.272069 -0.862957 -0.192349
H  -0.375758 0.878641 -0.20274
H  -2.877052 -1.696873 -0.545095
H  -2.415068 -0.782019 0.883315
O  -0.205812 -5.676985 -1.249732
H  0.648514 -6.11514 -1.128461
H  -1.992295 -4.348672 -2.52786
S  -2.926022 0.613349 -1.010954
H  -2.705675 1.473394 -0.010757
C  1.38713 -0.008937 -0.025266
O  2.001544 1.037453 -0.018773
C  2.121611 -1.342004 0.008116
H  2.202264 -1.639316 1.057236
H  1.55879 -2.131794 -0.486419
C  3.524934 -1.228562 -0.584019
H  4.022749 -2.201539 -0.537544
H  4.116842 -0.524339 -0.002493
C  3.520269 -0.717585 -2.022726
H  3.124929 0.299799 -2.039063
N  2.657105 -1.550473 -2.92452
H  3.153285 -1.637611 -3.820401
H  2.495569 -2.491069 -2.55517
C  4.897481 -0.702698 -2.672624
O  5.105484 -1.20961 -3.746765
O  5.792309 -0.065566 -1.935478
H  6.639196 -0.054104 -2.404579
H  1.720016 -1.122847 -3.046408
totalener: -1406.24289798 hartree
nucrepener: 1884.32048271 hartree
electener: -3290.56338069 hartree
oneelecener: -5651.79247945 hartree
twoeener: 2361.22909876 hartree
kineticenergy: 1400.66892239 hartree
exchangeener: -105.326420365615 hartree
correlationener: -7.055266984371 hartree
xcener: -112.381687349986 hartree
temp: 298.15 k
press: 1.00 atm
thermalcorrenthalpy: 0.00094421 hartree
totalenthalpy: -1405.99542241 hartree
totalentropycorr: -0.06571241 hartree
gibbsenthalpy: -1406.06113482 hartree
gibbsminuselec: 0.26385773 hartree
chargesum: 1.0000000
charge: -0.165278 0.187403 -0.088081 0.124405 0.324520 -0.380227 0.163048 0.070872 -0.359091 -0.176056 0.112128 -0.190757 0.167656 0.118127 0.150013 -0.226995 0.249497 0.165872 -0.116493 0.115077 0.195778 -0.328105 -0.131770 0.140502 0.019162 -0.201292 0.121745 0.146731 -0.005807 0.166873 -0.068728 0.222758 0.227096 0.301510 -0.312217 -0.233167 0.252278 0.241011
charge: 0.330944 -0.005492 -0.045704 0.038142 -0.428152 0.084521 -0.367782 -0.162001 0.121252 0.322175 0.031842 -0.233895 -0.017717 0.007502 0.016202 0.405647 -0.068906 0.047950 0.513994 -0.145744 -0.381003 0.107421 -0.011252 0.044962 0.007500 -0.000168 0.032203 0.047747 -0.044889 0.050687 0.612568 0.028462 0.029919 -0.429549 0.130206 0.410566 -0.063582 -0.016573
qa: -0.1653 0.1874 -0.0881 0.1244 0.3245 -0.3802 0.1630 0.0709 -0.3591 -0.1761 0.1121 -0.1908 0.1677 0.1181 0.1500 -0.2270 0.2495 0.1659 -0.1165 0.1151 0.1958 -0.3281 -0.1318 0.1405 0.0192 -0.2013 0.1217 0.1467 -0.0058 0.1669 -0.0687 0.2228 0.2271 0.3015 -0.3122 -0.2332 0.2523 0.2410
va: 3.1340 1.0170 3.8507 1.0092 4.2526 2.0734 4.2575 3.8345 2.1313 3.1313 0.9912 3.9621 1.0574 1.0075 1.0001 2.2837 1.0091 1.0001 2.1813 1.0188 4.3412 2.1869 3.7802 1.0101 1.0505 3.9160 1.0054 1.0236 3.7891 1.0291 3.5813 1.0159 1.0104 4.3484 2.1819 2.2792 1.0069 1.0511
dispcorr: -0.082816908 hartree
energy: -1406.330715145992
dipole: -0.73236 1.21462 0.48226 -5.38634 2.65846 -2.72788 4.40560 -4.64786 -0.24226
magnitude: 2.78076 au
magnitude: 7.06812 debye
zeropoint: 0.31111566 hartree
thermalvibcorrection: 0.01836051 hartree
thermalrotcorrection: 0.00141627 hartree
thermaltrasncorrection: 0.00141627 hartree
thermaltotal: -1405.99840643 hartree
thermalcorr: 0.02119306 hartree
nonthermalcorr: 0.31111566 hartree
totalcorr: 0.33230871 hartree
totalenthalpy: -1405.99746223 hartree
