program: Orca
programVersion: 5.0.2
elementType: N H C H C O C C O N H C H H H O H H S H C O C H H C H H C H N H H C O O H H
charge: 1
multiplicity: 1
keywords: wB97X-D3BJ Opt Freq def2-TZVPP def2/J RIJCOSX VeryTightSCF
keywords: PAL8 defgrid3 TightOpt
frequency: 0.00 0.00 0.00 0.00 0.00 0.00 23.24 31.69 50.29 58.43 64.01 72.34 78.44 87.50 96.38 104.86 128.98 168.29 188.16 195.77 215.45 236.45 243.31 270.49 272.23 304.56 325.87 346.42 363.83 381.67 413.77 434.33 479.18 513.91 531.97 557.93 589.72 599.49 614.98 619.42 660.34 662.81 668.90 711.81 736.55 750.87 780.19 796.87 812.35 828.42 854.50 909.67 917.74 923.52 955.09 970.28 991.83 1002.58 1062.34 1078.28 1089.58 1142.25 1143.62 1174.42 1175.49 1210.86 1221.22 1228.98 1231.61 1261.71 1279.75 1289.51 1315.36 1319.38 1336.02 1372.45 1377.38 1392.82 1412.49 1420.76 1450.76 1455.87 1466.13 1493.87 1498.05 1502.15 1503.52 1508.59 1516.39 1536.54 1648.60 1695.18 1788.66 1799.64 1818.37 1844.58 2764.90 3081.25 3099.38 3104.81 3121.55 3126.66 3131.45 3147.30 3158.85 3181.39 3186.89 3194.70 3354.42 3451.53 3592.03 3637.25 3784.16 3784.71
frequency: 23.24 31.69 50.29 58.43 64.01 72.34 78.44 87.50 96.38 104.86 128.98 168.29 188.16 195.77 215.45 236.45 243.31 270.49 272.23 304.56 325.87 346.42 363.83 381.67 413.77 434.33 479.18 513.91 531.97 557.93 589.72 599.49 614.98 619.42 660.34 662.81 668.90 711.81 736.55 750.87 780.19 796.87 812.35 828.42 854.50 909.67 917.74 923.52 955.09 970.28 991.83 1002.58 1062.34 1078.28 1089.58 1142.25 1143.62 1174.42 1175.49 1210.86 1221.22 1228.98 1231.61 1261.71 1279.75 1289.51 1315.36 1319.38 1336.02 1372.45 1377.38 1392.82 1412.49 1420.76 1450.76 1455.87 1466.13 1493.87 1498.05 1502.15 1503.52 1508.59 1516.39 1536.54 1648.60 1695.18 1788.66 1799.64 1818.37 1844.58 2764.90 3081.25 3099.38 3104.81 3121.55 3126.66 3131.45 3147.30 3158.85 3181.39 3186.89 3194.70 3354.42 3451.53 3592.03 3637.25 3784.16 3784.71
formula: C10H18N3O6S
InChI: InChI=1S/C10H18N3O6S/c11-5(10(18)19)1-2-7(14)13-6(4-20)9(17)12-3-8(15)16/h5-6,12-13,15,18,20H,1-4H2,11H3
38 atoms
N  -3.072627 -1.133909 -1.635823
H  -3.931504 -0.642938 -1.834287
C  -2.736936 -2.2628 -2.478766
H  -2.20883 -3.034314 -1.924742
C  -1.891172 -1.838878 -3.670551
O  -0.704122 -2.08065 -3.797238
C  -2.245869 -0.449748 -0.791461
C  -0.896153 -1.090991 -0.417857
O  -2.570987 0.610351 -0.30805
N  -0.014817 0.002206 -0.076352
H  -0.506632 -1.609361 -1.296203
C  -1.098481 -2.120495 0.727143
H  -0.453797 0.912984 -0.029831
H  -0.405164 -1.888546 1.531554
H  -2.111053 -2.083505 1.125128
O  -2.578162 -1.139789 -4.55477
H  -1.997448 -0.858832 -5.276845
H  -3.664884 -2.698217 -2.84881
S  -0.754895 -3.788056 0.08409
H  -0.688355 -4.446552 1.245817
C  1.350501 -0.008192 -0.088039
O  1.999706 1.014648 -0.131798
C  2.067522 -1.352413 0.011081
H  2.629426 -1.310414 0.946081
H  1.384981 -2.197087 0.102948
C  3.059007 -1.540602 -1.134916
H  3.718733 -2.390488 -0.937709
H  3.680526 -0.648323 -1.212659
C  2.367512 -1.741538 -2.483145
H  1.697127 -0.908536 -2.70033
N  1.563655 -3.009085 -2.515347
H  2.121463 -3.700726 -3.035637
H  1.339085 -3.360066 -1.581013
C  3.382117 -1.885943 -3.611996
O  3.57306 -2.939238 -4.165587
O  4.009077 -0.750075 -3.86157
H  4.66714 -0.891042 -4.558024
H  0.669271 -2.853075 -3.015986
totalener: -1406.22267348 hartree
nucrepener: 1891.66610057 hartree
electener: -3297.88877404 hartree
oneelecener: -5665.51101047 hartree
twoeener: 2367.62223643 hartree
kineticenergy: 1400.65013380 hartree
exchangeener: -105.318947136735 hartree
correlationener: -7.054791514151 hartree
xcener: -112.373738650887 hartree
temp: 298.15 k
press: 1.00 atm
thermalcorrenthalpy: 0.00094421 hartree
totalenthalpy: -1405.97531709 hartree
totalentropycorr: -0.06598177 hartree
gibbsenthalpy: -1406.04129887 hartree
gibbsminuselec: 0.26372123 hartree
chargesum: 1.0000000
charge: -0.210323 0.207493 -0.088418 0.125302 0.347221 -0.385940 0.198564 0.145724 -0.306370 -0.189657 -0.059205 -0.165555 0.205929 0.143172 0.154676 -0.218556 0.248294 0.162926 -0.195737 0.141197 0.159907 -0.309353 -0.131052 0.148748 0.035254 -0.235563 0.133396 0.150504 0.017590 0.146207 -0.073704 0.227935 0.209565 0.294149 -0.302665 -0.227250 0.254911 0.240684
charge: 0.327374 -0.002474 -0.047706 0.010654 -0.406220 0.110557 -0.376291 -0.152849 0.128089 0.331038 0.002273 -0.202349 -0.010389 0.011223 0.013472 0.414970 -0.065345 0.045885 0.489779 -0.134263 -0.394550 0.108350 -0.012033 0.048959 -0.003359 0.000649 0.034640 0.050463 -0.048356 0.045205 0.606857 0.031439 0.009516 -0.432338 0.137475 0.414129 -0.061027 -0.023447
qa: -0.2103 0.2075 -0.0884 0.1253 0.3472 -0.3859 0.1986 0.1457 -0.3064 -0.1897 -0.0592 -0.1656 0.2059 0.1432 0.1547 -0.2186 0.2483 0.1629 -0.1957 0.1412 0.1599 -0.3094 -0.1311 0.1487 0.0353 -0.2356 0.1334 0.1505 0.0176 0.1462 -0.0737 0.2279 0.2096 0.2941 -0.3027 -0.2272 0.2549 0.2407
va: 3.1321 1.0063 3.8459 1.0273 4.1700 2.0605 4.3532 3.8003 2.2064 3.0770 1.0684 3.8660 1.0287 1.0084 1.0033 2.3024 1.0095 1.0003 2.1803 1.0154 4.3558 2.2174 3.7369 1.0127 1.0799 3.9344 1.0017 1.0263 3.7776 1.0212 3.5559 1.0168 1.0359 4.3777 2.1920 2.2955 1.0041 1.0519
dispcorr: -0.082765127 hartree
energy: -1406.310745594571
dipole: 2.31681 -2.16402 0.15279 -6.57286 3.97044 -2.60242 4.51709 -5.92555 -1.40847
magnitude: 2.96306 au
magnitude: 7.53150 debye
zeropoint: 0.31111585 hartree
thermalvibcorrection: 0.01855017 hartree
thermalrotcorrection: 0.00141627 hartree
thermaltrasncorrection: 0.00141627 hartree
thermaltotal: -1405.97824704 hartree
thermalcorr: 0.02138271 hartree
nonthermalcorr: 0.31111585 hartree
totalcorr: 0.33249856 hartree
totalenthalpy: -1405.97730283 hartree
