program: Orca
programVersion: 5.0.2
elementType: N H C H C O C C O N H C H H H O H H S H C O C H H C H H C H N H H C O O H H
charge: 1
multiplicity: 1
keywords: wB97X-D3BJ Opt Freq def2-TZVPP def2/J RIJCOSX VeryTightSCF
keywords: PAL8 defgrid3 TightOpt
frequency: 0.00 0.00 0.00 0.00 0.00 0.00 19.94 39.06 51.60 58.52 70.24 71.96 92.03 100.12 106.89 110.83 123.16 142.32 171.33 176.81 191.56 210.63 215.32 229.96 265.76 302.61 307.52 314.88 325.22 361.23 397.90 422.98 488.20 505.03 536.35 558.05 577.29 606.28 639.97 654.14 661.35 668.44 686.49 730.34 750.54 779.70 789.70 814.25 828.60 865.70 880.31 896.90 926.85 957.24 978.44 1001.38 1006.95 1029.84 1041.19 1107.54 1110.15 1124.51 1150.77 1158.37 1171.46 1216.49 1224.66 1225.71 1266.67 1278.05 1288.23 1297.17 1301.48 1341.70 1356.66 1362.52 1370.95 1375.03 1400.08 1433.21 1450.74 1453.04 1475.16 1475.46 1487.63 1493.09 1508.07 1509.24 1515.99 1520.53 1640.65 1675.07 1794.84 1798.90 1809.25 1830.55 2754.18 3069.24 3075.05 3085.79 3111.89 3120.79 3125.48 3145.43 3155.41 3156.59 3173.66 3186.02 3266.63 3494.44 3551.27 3613.55 3626.78 3784.27
frequency: 19.94 39.06 51.60 58.52 70.24 71.96 92.03 100.12 106.89 110.83 123.16 142.32 171.33 176.81 191.56 210.63 215.32 229.96 265.76 302.61 307.52 314.88 325.22 361.23 397.90 422.98 488.20 505.03 536.35 558.05 577.29 606.28 639.97 654.14 661.35 668.44 686.49 730.34 750.54 779.70 789.70 814.25 828.60 865.70 880.31 896.90 926.85 957.24 978.44 1001.38 1006.95 1029.84 1041.19 1107.54 1110.15 1124.51 1150.77 1158.37 1171.46 1216.49 1224.66 1225.71 1266.67 1278.05 1288.23 1297.17 1301.48 1341.70 1356.66 1362.52 1370.95 1375.03 1400.08 1433.21 1450.74 1453.04 1475.16 1475.46 1487.63 1493.09 1508.07 1509.24 1515.99 1520.53 1640.65 1675.07 1794.84 1798.90 1809.25 1830.55 2754.18 3069.24 3075.05 3085.79 3111.89 3120.79 3125.48 3145.43 3155.41 3156.59 3173.66 3186.02 3266.63 3494.44 3551.27 3613.55 3626.78 3784.27
formula: C10H18N3O6S
InChI: InChI=1S/C10H18N3O6S/c11-5(10(18)19)1-2-7(14)13-6(4-20)9(17)12-3-8(15)16/h5-6,12-13,15,18,20H,1-4H2,11H3
38 atoms
N  -0.800107 -2.642803 -2.236517
H  -1.122989 -2.718306 -3.191379
C  -0.588053 -3.895345 -1.533407
H  0.035504 -3.75101 -0.655856
C  0.128939 -4.868563 -2.447897
O  1.198656 -5.394543 -2.214963
C  -1.09417 -1.422285 -1.684879
C  -0.849396 -1.1773 -0.186998
O  -1.515226 -0.515018 -2.368596
N  0.012583 -0.021841 -0.010864
H  -0.393533 -2.034288 0.302312
C  -2.197703 -0.915454 0.484609
H  -0.400252 0.882846 -0.187543
H  -2.046394 -0.761141 1.552597
H  -2.652783 -0.017204 0.06922
O  -0.552763 -5.104497 -3.559013
H  -0.055874 -5.721341 -4.116033
H  -1.528319 -4.355212 -1.210634
S  -3.340957 -2.306325 0.304021
H  -3.816861 -1.964419 -0.899035
C  1.372758 -0.026169 -0.035163
O  2.031926 0.993408 -0.056934
C  2.042717 -1.396448 -0.018609
H  1.803275 -1.909654 0.916735
H  1.630717 -1.999337 -0.82851
C  3.54753 -1.240207 -0.189435
H  3.918643 -0.50637 0.528946
H  3.749809 -0.840401 -1.187634
C  4.313488 -2.554965 -0.0149
H  4.31996 -2.891312 1.020786
N  5.733755 -2.337119 -0.471812
H  5.732419 -2.605402 -1.472872
H  6.025671 -1.366202 -0.362965
C  3.780899 -3.644369 -0.948689
O  4.28877 -3.80212 -2.035283
O  2.757396 -4.278339 -0.443195
H  2.272822 -4.828122 -1.1261
H  6.399794 -2.938215 0.01249
totalener: -1406.21947970 hartree
nucrepener: 1845.22981418 hartree
electener: -3251.44929387 hartree
oneelecener: -5574.48120963 hartree
twoeener: 2323.03191576 hartree
kineticenergy: 1400.61346432 hartree
exchangeener: -105.314472385110 hartree
correlationener: -7.051893855974 hartree
xcener: -112.366366241084 hartree
temp: 298.15 k
press: 1.00 atm
thermalcorrenthalpy: 0.00094421 hartree
totalenthalpy: -1405.96984926 hartree
totalentropycorr: -0.06630606 hartree
gibbsenthalpy: -1406.03615532 hartree
gibbsminuselec: 0.26224892 hartree
chargesum: 1.0000000
charge: -0.182075 0.189700 -0.043102 0.082341 0.330118 -0.329706 0.117640 0.024525 -0.306583 -0.173106 0.087454 -0.154383 0.197184 0.134253 0.145278 -0.242702 0.252038 0.150437 -0.156187 0.125980 0.202229 -0.337191 -0.153776 0.129094 0.057100 -0.226387 0.131005 0.130824 0.018424 0.160218 -0.052074 0.239531 0.239578 0.306310 -0.311877 -0.294734 0.272458 0.240163
charge: 0.309097 -0.010368 -0.052604 0.021671 -0.395189 0.172841 -0.399198 -0.159129 0.110395 0.339196 0.019404 -0.231411 -0.001176 0.013334 0.015420 0.403277 -0.065170 0.029291 0.502432 -0.140927 -0.377853 0.096309 -0.014986 0.034548 0.025576 -0.008385 0.037683 0.040694 -0.040302 0.042171 0.616812 0.041295 0.054825 -0.462073 0.131274 0.392650 -0.147566 0.056139
qa: -0.1821 0.1897 -0.0431 0.0823 0.3301 -0.3297 0.1176 0.0245 -0.3066 -0.1731 0.0875 -0.1544 0.1972 0.1343 0.1453 -0.2427 0.2520 0.1504 -0.1562 0.1260 0.2022 -0.3372 -0.1538 0.1291 0.0571 -0.2264 0.1310 0.1308 0.0184 0.1602 -0.0521 0.2395 0.2396 0.3063 -0.3119 -0.2947 0.2725 0.2402
va: 2.9737 1.0254 3.8344 1.0176 4.2812 2.1601 4.3812 3.9029 2.2302 3.1806 1.0015 3.9397 1.0201 1.0072 1.0117 2.2665 1.0070 1.0169 2.1697 1.0196 4.3741 2.1835 3.7914 1.0034 1.0530 3.9794 1.0214 1.0049 3.8211 1.0011 3.6451 1.0155 0.9702 4.3054 2.1834 2.2379 1.0649 0.9717
dispcorr: -0.079613714 hartree
energy: -1406.304072489143
dipole: 9.26284 -4.25369 5.00915 2.00174 -3.74504 -1.74330 5.55699 -4.65410 0.90289
magnitude: 5.38014 au
magnitude: 13.67523 debye
zeropoint: 0.31036841 hartree
thermalvibcorrection: 0.01878048 hartree
thermalrotcorrection: 0.00141627 hartree
thermaltrasncorrection: 0.00141627 hartree
thermaltotal: -1405.97209105 hartree
thermalcorr: 0.02161303 hartree
nonthermalcorr: 0.31036841 hartree
totalcorr: 0.33198144 hartree
totalenthalpy: -1405.97114684 hartree
