program: Orca
programVersion: 5.0.2
elementType: N H C H C O C C O N H C H H H O H H S H C O C H H C H H C H N H H C O O H H
charge: 1
multiplicity: 1
keywords: wB97X-D3BJ Opt Freq def2-TZVPP def2/J RIJCOSX VeryTightSCF
keywords: PAL8 defgrid3 TightOpt
frequency: 0.00 0.00 0.00 0.00 0.00 0.00 17.69 32.43 36.02 55.37 66.52 72.07 78.39 88.36 115.45 118.50 143.63 165.83 188.27 213.37 224.77 229.75 236.99 254.27 277.49 282.01 311.73 325.87 365.89 416.51 457.75 461.71 489.67 516.01 546.32 565.40 599.06 605.73 624.91 633.69 662.77 695.01 701.67 730.32 742.41 754.28 764.49 790.28 803.16 813.66 842.00 896.78 903.00 917.85 945.84 986.37 1019.93 1025.20 1063.73 1069.26 1108.95 1132.63 1157.53 1167.86 1173.60 1207.87 1220.50 1231.03 1245.62 1250.78 1278.99 1287.70 1308.60 1313.95 1340.58 1348.65 1371.20 1376.88 1399.33 1407.52 1429.17 1447.11 1466.89 1471.66 1477.29 1484.95 1489.78 1500.84 1522.10 1550.55 1679.94 1681.44 1795.03 1808.75 1842.64 1844.37 2756.38 3030.46 3079.23 3097.35 3105.30 3110.54 3123.31 3139.18 3143.74 3153.31 3168.71 3172.50 3339.57 3548.37 3559.89 3612.50 3670.13 3782.62
frequency: 17.69 32.43 36.02 55.37 66.52 72.07 78.39 88.36 115.45 118.50 143.63 165.83 188.27 213.37 224.77 229.75 236.99 254.27 277.49 282.01 311.73 325.87 365.89 416.51 457.75 461.71 489.67 516.01 546.32 565.40 599.06 605.73 624.91 633.69 662.77 695.01 701.67 730.32 742.41 754.28 764.49 790.28 803.16 813.66 842.00 896.78 903.00 917.85 945.84 986.37 1019.93 1025.20 1063.73 1069.26 1108.95 1132.63 1157.53 1167.86 1173.60 1207.87 1220.50 1231.03 1245.62 1250.78 1278.99 1287.70 1308.60 1313.95 1340.58 1348.65 1371.20 1376.88 1399.33 1407.52 1429.17 1447.11 1466.89 1471.66 1477.29 1484.95 1489.78 1500.84 1522.10 1550.55 1679.94 1681.44 1795.03 1808.75 1842.64 1844.37 2756.38 3030.46 3079.23 3097.35 3105.30 3110.54 3123.31 3139.18 3143.74 3153.31 3168.71 3172.50 3339.57 3548.37 3559.89 3612.50 3670.13 3782.62
formula: C10H18N3O6S
InChI: InChI=1S/C10H18N3O6S/c11-5(10(18)19)1-2-7(14)13-6(4-20)9(17)12-3-8(15)16/h5-6,12-13,15,18,20H,1-4H2,11H3
38 atoms
N  -2.022571 -1.43734 -1.864056
H  -2.900249 -1.330936 -2.353592
C  -1.247112 -2.603698 -2.234771
H  -1.19848 -3.364012 -1.453392
C  0.178337 -2.285885 -2.652378
O  1.029241 -3.153771 -2.699613
C  -2.151025 -0.992352 -0.545194
C  -0.90723 -1.075055 0.358277
O  -3.172984 -0.479047 -0.172487
N  -0.014511 -0.006346 -0.056236
H  -0.410527 -2.034926 0.209822
C  -1.317301 -0.966183 1.833062
H  -0.39581 0.918227 0.112965
H  -2.130044 -1.663082 2.034669
H  -0.4728 -1.24535 2.460811
O  0.45566 -1.037614 -2.958801
H  -0.321249 -0.485128 -2.759071
H  -1.715768 -3.082856 -3.097155
S  -1.870668 0.695775 2.306119
H  -0.788182 1.016842 3.023153
C  1.354715 0.008453 -0.098752
O  1.9580 1.057603 -0.168171
C  2.128701 -1.307769 -0.10201
H  2.430193 -1.502047 0.932242
H  1.518653 -2.152764 -0.416804
C  3.359968 -1.129715 -0.993891
H  3.966614 -0.318306 -0.595643
H  3.053286 -0.819919 -1.99532
C  4.250848 -2.364591 -1.120203
H  5.174785 -2.090022 -1.629078
N  3.595997 -3.468607 -1.903582
H  2.662636 -3.205679 -2.295945
H  4.183434 -3.788105 -2.670357
C  4.598195 -2.976169 0.233059
O  4.229687 -4.078231 0.553349
O  5.312339 -2.14961 0.977543
H  5.513194 -2.570153 1.826637
H  3.464987 -4.257273 -1.252911
totalener: -1406.22001308 hartree
nucrepener: 1872.14801732 hartree
electener: -3278.36803040 hartree
oneelecener: -5627.45467026 hartree
twoeener: 2349.08663986 hartree
kineticenergy: 1400.63742073 hartree
exchangeener: -105.311327411467 hartree
correlationener: -7.054374017897 hartree
xcener: -112.365701429365 hartree
temp: 298.15 k
press: 1.00 atm
thermalcorrenthalpy: 0.00094421 hartree
totalenthalpy: -1405.97268595 hartree
totalentropycorr: -0.06553294 hartree
gibbsenthalpy: -1406.03821889 hartree
gibbsminuselec: 0.26335939 hartree
chargesum: 1.0000000
charge: -0.262216 0.203219 -0.083446 0.137229 0.328761 -0.385191 0.200150 0.003177 -0.259284 -0.212492 0.097272 -0.178760 0.196502 0.129889 0.115437 -0.206954 0.253387 0.152740 -0.113801 0.107607 0.202284 -0.316104 -0.190490 0.137221 0.062056 -0.187331 0.158322 0.130369 -0.021833 0.166320 -0.057866 0.221152 0.230293 0.294735 -0.301400 -0.231112 0.258082 0.222077
charge: 0.290999 -0.012025 -0.052743 0.035651 -0.427818 0.133647 -0.364483 -0.157968 0.159748 0.314480 0.022866 -0.231052 -0.017393 0.015048 0.004759 0.421267 -0.087541 0.051117 0.509853 -0.153833 -0.386119 0.114269 -0.014706 0.036089 0.007075 -0.001595 0.048962 0.036978 -0.045864 0.047462 0.611373 -0.035401 0.045648 -0.439222 0.137604 0.414196 -0.061111 0.029782
qa: -0.2622 0.2032 -0.0834 0.1372 0.3288 -0.3852 0.2002 0.0032 -0.2593 -0.2125 0.0973 -0.1788 0.1965 0.1299 0.1154 -0.2070 0.2534 0.1527 -0.1138 0.1076 0.2023 -0.3161 -0.1905 0.1372 0.0621 -0.1873 0.1583 0.1304 -0.0218 0.1663 -0.0579 0.2212 0.2303 0.2947 -0.3014 -0.2311 0.2581 0.2221
va: 3.0076 1.0057 3.8583 1.0116 4.1797 2.1391 4.2759 3.8598 2.2354 2.9999 1.0056 4.0547 1.0419 1.0055 0.9973 2.2738 1.0217 1.0002 2.1830 1.0183 4.3065 2.2048 3.7567 1.0206 1.0396 3.8348 1.0275 1.0220 3.8540 0.9988 3.5755 1.0888 0.9769 4.3195 2.1879 2.2910 1.0018 1.0212
dispcorr: -0.082091313 hartree
energy: -1406.307431457695
dipole: 5.99463 -3.14183 2.85279 -6.82764 3.58101 -3.24663 -2.58005 0.80698 -1.77307
magnitude: 4.67149 au
magnitude: 11.87398 debye
zeropoint: 0.31065277 hartree
thermalvibcorrection: 0.01840587 hartree
thermalrotcorrection: 0.00141627 hartree
thermaltrasncorrection: 0.00141627 hartree
thermaltotal: -1405.97554027 hartree
thermalcorr: 0.02123841 hartree
nonthermalcorr: 0.31065277 hartree
totalcorr: 0.33189118 hartree
totalenthalpy: -1405.97459606 hartree
